Getting an error stating libX11 not found (even though I know for certain it is installed) when trying to configure GTK+. Here's the configure.log file:

This file contains any messages produced by compilers while
running configure, to aid debugging if configure makes a mistake.

It was created by gtk+ configure 2.6.8, which was
generated by GNU Autoconf 2.59. Invocation command line was

$ ./configure

## --------- ##
## Platform. ##
## --------- ##

hostname = seanr-laptop
uname -m = i686
uname -r = 2.6.10
uname -s = Linux
uname -v = #1 Wed Jan 5 08:54:58 EST 2005

/usr/bin/uname -p = unknown
/bin/uname -X = unknown

/bin/arch = i686
/usr/bin/arch -k = unknown
/usr/convex/getsysinfo = unknown
hostinfo = unknown
/bin/machine = unknown
/usr/bin/oslevel = unknown
/bin/universe = unknown

PATH: /bin
PATH: /sbin
PATH: /usr/bin
PATH: /usr/sbin
PATH: /usr/X11R6/bin
PATH: /usr/local/bin
PATH: /usr/local/sbin
PATH: /usr/games


## ----------- ##
## Core tests. ##
## ----------- ##

configure:1602: checking for a BSD-compatible install
configure:1657: result: /usr/bin/install -c
configure:1668: checking whether build environment is sane
configure:1711: result: yes
configure:1744: checking for gawk
configure:1760: found /usr/bin/gawk
configure:1770: result: gawk
configure:1780: checking whether make sets $(MAKE)
configure:1800: result: yes
configure:2029: checking build system type
configure:2047: result: i686-pc-linux-gnu
configure:2055: checking host system type
configure:2069: result: i686-pc-linux-gnu
configure:2079: checking for native Win32
configure:2090: result: no
configure:2144: checking for gcc
configure:2160: found /usr/bin/gcc
configure:2170: result: gcc
configure:2414: checking for C compiler version
configure:2417: gcc --version </dev/null >&5
gcc (GCC) 3.3.5 (Debian 1:3.3.5-6)
Copyright (C) 2003 Free Software Foundation, Inc.
This is free software; see the source for copying conditions. There is NO
warranty; not even for MERCHANTABILITY or FITNESS FOR A PARTICULAR PURPOSE.

configure:2420: $? = 0
configure:2422: gcc -v </dev/null >&5
Reading specs from /usr/lib/gcc-lib/i486-linux/3.3.5/specs
Configured with: ../src/configure -v --enable-languages=c,c++,java,f77,pascal,objc,ada,treelang --prefix=/usr --mandir=/usr/share/man --infodir=/usr/share/info --with-gxx-include-dir=/usr/include/c++/3.3 --enable-shared --with-system-zlib --enable-nls --without-included-gettext --enable-__cxa_atexit --enable-clocale=gnu --enable-debug --enable-java-gc=boehm --enable-java-awt=xlib --enable-objc-gc i486-linux
Thread model: posix
gcc version 3.3.5 (Debian 1:3.3.5-6)
configure:2425: $? = 0
configure:2427: gcc -V </dev/null >&5
gcc: `-V' option must have argument
configure:2430: $? = 1
configure:2453: checking for C compiler default output file name
configure:2456: gcc conftest.c >&5
configure:2459: $? = 0
configure:2505: result: a.out
configure:2510: checking whether the C compiler works
configure:2516: ./a.out
configure:2519: $? = 0
configure:2536: result: yes
configure:2543: checking whether we are cross compiling
configure:2545: result: no
configure:2548: checking for suffix of executables
configure:2550: gcc -o conftest conftest.c >&5
configure:2553: $? = 0
configure:2578: result:
configure:2584: checking for suffix of object files
configure:2605: gcc -c conftest.c >&5
configure:2608: $? = 0
configure:2630: result: o
configure:2634: checking whether we are using the GNU C compiler
configure:2658: gcc -c conftest.c >&5
configure:2664: $? = 0
configure:2668: test -z
|| test ! -s conftest.err
configure:2671: $? = 0
configure:2674: test -s conftest.o
configure:2677: $? = 0
configure:2690: result: yes
configure:2696: checking whether gcc accepts -g
configure:2717: gcc -c -g conftest.c >&5
configure:2723: $? = 0
configure:2727: test -z
|| test ! -s conftest.err
configure:2730: $? = 0
configure:2733: test -s conftest.o
configure:2736: $? = 0
configure:2747: result: yes
configure:2764: checking for gcc option to accept ANSI C
configure:2834: gcc -c -g -O2 conftest.c >&5
configure:2840: $? = 0
configure:2844: test -z
|| test ! -s conftest.err
configure:2847: $? = 0
configure:2850: test -s conftest.o
configure:2853: $? = 0
configure:2871: result: none needed
configure:2889: gcc -c -g -O2 conftest.c >&5
conftest.c:2: error: parse error before "me"
configure:2895: $? = 1
configure: failed program was:
| #ifndef __cplusplus
| choke me
| #endif
configure:3039: checking for style of include used by make
configure:3067: result: GNU
configure:3095: checking dependency style of gcc
configure:3178: result: gcc3
configure:3284: checking for a sed that does not truncate output
configure:3338: result: /bin/sed
configure:3341: checking for egrep
configure:3351: result: grep -E
configure:3367: checking for ld used by gcc
configure:3434: result: /usr/bin/ld
configure:3443: checking if the linker (/usr/bin/ld) is GNU ld
configure:3458: result: yes
configure:3463: checking for /usr/bin/ld option to reload object files
configure:3470: result: -r
configure:3488: checking for BSD-compatible nm
configure:3530: result: /usr/bin/nm -B
configure:3534: checking whether ln -s works
configure:3538: result: yes
configure:3545: checking how to recognise dependent libraries
configure:3717: result: pass_all
configure:4173: checking how to run the C preprocessor
configure:4208: gcc -E conftest.c
configure:4214: $? = 0
configure:4246: gcc -E conftest.c
conftest.c:10:28: ac_nonexistent.h: No such file or directory
configure:4252: $? = 1
configure: failed program was:
| /* confdefs.h. */
|
| #define PACKAGE_NAME "gtk+"
| #define PACKAGE_TARNAME "gtk+"
| #define PACKAGE_VERSION "2.6.8"
| #define PACKAGE_STRING "gtk+ 2.6.8"
| #define PACKAGE_BUGREPORT "http://bugzilla.gnome.org/enter_bug.cgi?product=gtk%2B"
| #define GETTEXT_PACKAGE "gtk20"
| /* end confdefs.h. */
| #include <ac_nonexistent.h>
configure:4291: result: gcc -E
configure:4315: gcc -E conftest.c
configure:4321: $? = 0
configure:4353: gcc -E conftest.c
conftest.c:10:28: ac_nonexistent.h: No such file or directory
configure:4359: $? = 1
configure: failed program was:
| /* confdefs.h. */
|
| #define PACKAGE_NAME "gtk+"
| #define PACKAGE_TARNAME "gtk+"
| #define PACKAGE_VERSION "2.6.8"
| #define PACKAGE_STRING "gtk+ 2.6.8"
| #define PACKAGE_BUGREPORT "http://bugzilla.gnome.org/enter_bug.cgi?product=gtk%2B"
| #define GETTEXT_PACKAGE "gtk20"
| /* end confdefs.h. */
| #include <ac_nonexistent.h>
configure:4403: checking for ANSI C header files
configure:4428: gcc -c -g -O2 conftest.c >&5
configure:4434: $? = 0
configure:4438: test -z
|| test ! -s conftest.err
configure:4441: $? = 0
configure:4444: test -s conftest.o
configure:4447: $? = 0
configure:4536: gcc -o conftest -g -O2 conftest.c >&5
configure:4539: $? = 0
configure:4541: ./conftest
configure:4544: $? = 0
configure:4559: result: yes
configure:4583: checking for sys/types.h
configure:4599: gcc -c -g -O2 conftest.c >&5
configure:4605: $? = 0
configure:4609: test -z
|| test ! -s conftest.err
configure:4612: $? = 0
configure:4615: test -s conftest.o
configure:4618: $? = 0
configure:4629: result: yes
configure:4583: checking for sys/stat.h
configure:4599: gcc -c -g -O2 conftest.c >&5
configure:4605: $? = 0
configure:4609: test -z
|| test ! -s conftest.err
configure:4612: $? = 0
configure:4615: test -s conftest.o
configure:4618: $? = 0
configure:4629: result: yes
configure:4583: checking for stdlib.h
configure:4599: gcc -c -g -O2 conftest.c >&5
configure:4605: $? = 0
configure:4609: test -z
|| test ! -s conftest.err
configure:4612: $? = 0
configure:4615: test -s conftest.o
configure:4618: $? = 0
configure:4629: result: yes
configure:4583: checking for string.h
configure:4599: gcc -c -g -O2 conftest.c >&5
configure:4605: $? = 0
configure:4609: test -z
|| test ! -s conftest.err
configure:4612: $? = 0
configure:4615: test -s conftest.o
configure:4618: $? = 0
configure:4629: result: yes
configure:4583: checking for memory.h
configure:4599: gcc -c -g -O2 conftest.c >&5
configure:4605: $? = 0
configure:4609: test -z
|| test ! -s conftest.err
configure:4612: $? = 0
configure:4615: test -s conftest.o
configure:4618: $? = 0
configure:4629: result: yes
configure:4583: checking for strings.h
configure:4599: gcc -c -g -O2 conftest.c >&5
configure:4605: $? = 0
configure:4609: test -z
|| test ! -s conftest.err
configure:4612: $? = 0
configure:4615: test -s conftest.o
configure:4618: $? = 0
configure:4629: result: yes
configure:4583: checking for inttypes.h
configure:4599: gcc -c -g -O2 conftest.c >&5
configure:4605: $? = 0
configure:4609: test -z
|| test ! -s conftest.err
configure:4612: $? = 0
configure:4615: test -s conftest.o
configure:4618: $? = 0
configure:4629: result: yes
configure:4583: checking for stdint.h
configure:4599: gcc -c -g -O2 conftest.c >&5
configure:4605: $? = 0
configure:4609: test -z
|| test ! -s conftest.err
configure:4612: $? = 0
configure:4615: test -s conftest.o
configure:4618: $? = 0
configure:4629: result: yes
configure:4583: checking for unistd.h
configure:4599: gcc -c -g -O2 conftest.c >&5
configure:4605: $? = 0
configure:4609: test -z
|| test ! -s conftest.err
configure:4612: $? = 0
configure:4615: test -s conftest.o
configure:4618: $? = 0
configure:4629: result: yes
configure:4655: checking dlfcn.h usability
configure:4667: gcc -c -g -O2 conftest.c >&5
configure:4673: $? = 0
configure:4677: test -z
|| test ! -s conftest.err
configure:4680: $? = 0
configure:4683: test -s conftest.o
configure:4686: $? = 0
configure:4696: result: yes
configure:4700: checking dlfcn.h presence
configure:4710: gcc -E conftest.c
configure:4716: $? = 0
configure:4736: result: yes
configure:4771: checking for dlfcn.h
configure:4778: result: yes
configure:4843: checking for g++
configure:4859: found /usr/bin/g++
configure:4869: result: g++
configure:4885: checking for C++ compiler version
configure:4888: g++ --version </dev/null >&5
g++ (GCC) 3.3.5 (Debian 1:3.3.5-6)
Copyright (C) 2003 Free Software Foundation, Inc.
This is free software; see the source for copying conditions. There is NO
warranty; not even for MERCHANTABILITY or FITNESS FOR A PARTICULAR PURPOSE.

configure:4891: $? = 0
configure:4893: g++ -v </dev/null >&5
Reading specs from /usr/lib/gcc-lib/i486-linux/3.3.5/specs
Configured with: ../src/configure -v --enable-languages=c,c++,java,f77,pascal,objc,ada,treelang --prefix=/usr --mandir=/usr/share/man --infodir=/usr/share/info --with-gxx-include-dir=/usr/include/c++/3.3 --enable-shared --with-system-zlib --enable-nls --without-included-gettext --enable-__cxa_atexit --enable-clocale=gnu --enable-debug --enable-java-gc=boehm --enable-java-awt=xlib --enable-objc-gc i486-linux
Thread model: posix
gcc version 3.3.5 (Debian 1:3.3.5-6)
configure:4896: $? = 0
configure:4898: g++ -V </dev/null >&5
g++: `-V' option must have argument
configure:4901: $? = 1
configure:4904: checking whether we are using the GNU C++ compiler
configure:4928: g++ -c conftest.cc >&5
configure:4934: $? = 0
configure:4938: test -z
|| test ! -s conftest.err
configure:4941: $? = 0
configure:4944: test -s conftest.o
configure:4947: $? = 0
configure:4960: result: yes
configure:4966: checking whether g++ accepts -g
configure:4987: g++ -c -g conftest.cc >&5
configure:4993: $? = 0
configure:4997: test -z
|| test ! -s conftest.err
configure:5000: $? = 0
configure:5003: test -s conftest.o
configure:5006: $? = 0
configure:5017: result: yes
configure:5059: g++ -c -g -O2 conftest.cc >&5
configure:5065: $? = 0
configure:5069: test -z
|| test ! -s conftest.err
configure:5072: $? = 0
configure:5075: test -s conftest.o
configure:5078: $? = 0
configure:5104: g++ -c -g -O2 conftest.cc >&5
conftest.cc: In function `int main()':
conftest.cc:25: error: `exit' undeclared (first use this function)
conftest.cc:25: error: (Each undeclared identifier is reported only once for
each function it appears in.)
configure:5110: $? = 1
configure: failed program was:
| /* confdefs.h. */
|
| #define PACKAGE_NAME "gtk+"
| #define PACKAGE_TARNAME "gtk+"
| #define PACKAGE_VERSION "2.6.8"
| #define PACKAGE_STRING "gtk+ 2.6.8"
| #define PACKAGE_BUGREPORT "http://bugzilla.gnome.org/enter_bug.cgi?product=gtk%2B"
| #define GETTEXT_PACKAGE "gtk20"
| #define STDC_HEADERS 1
| #define HAVE_SYS_TYPES_H 1
| #define HAVE_SYS_STAT_H 1
| #define HAVE_STDLIB_H 1
| #define HAVE_STRING_H 1
| #define HAVE_MEMORY_H 1
| #define HAVE_STRINGS_H 1
| #define HAVE_INTTYPES_H 1
| #define HAVE_STDINT_H 1
| #define HAVE_UNISTD_H 1
| #define HAVE_DLFCN_H 1
| /* end confdefs.h. */
|
| int
| main ()
| {
| exit (42);
| ;
| return 0;
| }
configure:5059: g++ -c -g -O2 conftest.cc >&5
configure:5065: $? = 0
configure:5069: test -z
|| test ! -s conftest.err
configure:5072: $? = 0
configure:5075: test -s conftest.o
configure:5078: $? = 0
configure:5104: g++ -c -g -O2 conftest.cc >&5
configure:5110: $? = 0
configure:5114: test -z
|| test ! -s conftest.err
configure:5117: $? = 0
configure:5120: test -s conftest.o
configure:5123: $? = 0
configure:5148: checking dependency style of g++
configure:5231: result: gcc3
configure:5258: checking how to run the C++ preprocessor
configure:5289: g++ -E conftest.cc
configure:5295: $? = 0
configure:5327: g++ -E conftest.cc
conftest.cc:24:28: ac_nonexistent.h: No such file or directory
configure:5333: $? = 1
configure: failed program was:
| /* confdefs.h. */
|
| #define PACKAGE_NAME "gtk+"
| #define PACKAGE_TARNAME "gtk+"
| #define PACKAGE_VERSION "2.6.8"
| #define PACKAGE_STRING "gtk+ 2.6.8"
| #define PACKAGE_BUGREPORT "http://bugzilla.gnome.org/enter_bug.cgi?product=gtk%2B"
| #define GETTEXT_PACKAGE "gtk20"
| #define STDC_HEADERS 1
| #define HAVE_SYS_TYPES_H 1
| #define HAVE_SYS_STAT_H 1
| #define HAVE_STDLIB_H 1
| #define HAVE_STRING_H 1
| #define HAVE_MEMORY_H 1
| #define HAVE_STRINGS_H 1
| #define HAVE_INTTYPES_H 1
| #define HAVE_STDINT_H 1
| #define HAVE_UNISTD_H 1
| #define HAVE_DLFCN_H 1
| #ifdef __cplusplus
| extern "C" void std::exit (int) throw (); using std::exit;
| #endif
| /* end confdefs.h. */
| #include <ac_nonexistent.h>
configure:5372: result: g++ -E
configure:5396: g++ -E conftest.cc
configure:5402: $? = 0
configure:5434: g++ -E conftest.cc
conftest.cc:24:28: ac_nonexistent.h: No such file or directory
configure:5440: $? = 1
configure: failed program was:
| /* confdefs.h. */
|
| #define PACKAGE_NAME "gtk+"
| #define PACKAGE_TARNAME "gtk+"
| #define PACKAGE_VERSION "2.6.8"
| #define PACKAGE_STRING "gtk+ 2.6.8"
| #define PACKAGE_BUGREPORT "http://bugzilla.gnome.org/enter_bug.cgi?product=gtk%2B"
| #define GETTEXT_PACKAGE "gtk20"
| #define STDC_HEADERS 1
| #define HAVE_SYS_TYPES_H 1
| #define HAVE_SYS_STAT_H 1
| #define HAVE_STDLIB_H 1
| #define HAVE_STRING_H 1
| #define HAVE_MEMORY_H 1
| #define HAVE_STRINGS_H 1
| #define HAVE_INTTYPES_H 1
| #define HAVE_STDINT_H 1
| #define HAVE_UNISTD_H 1
| #define HAVE_DLFCN_H 1
| #ifdef __cplusplus
| extern "C" void std::exit (int) throw (); using std::exit;
| #endif
| /* end confdefs.h. */
| #include <ac_nonexistent.h>
configure:5537: checking for g77
configure:5566: result: no
configure:5537: checking for f77
configure:5566: result: no
configure:5537: checking for xlf
configure:5566: result: no
configure:5537: checking for frt
configure:5566: result: no
configure:5537: checking for pgf77
configure:5566: result: no
configure:5537: checking for fort77
configure:5566: result: no
configure:5537: checking for fl32
configure:5566: result: no
configure:5537: checking for af77
configure:5566: result: no
configure:5537: checking for f90
configure:5566: result: no
configure:5537: checking for xlf90
configure:5566: result: no
configure:5537: checking for pgf90
configure:5566: result: no
configure:5537: checking for epcf90
configure:5566: result: no
configure:5537: checking for f95
configure:5566: result: no
configure:5537: checking for fort
configure:5566: result: no
configure:5537: checking for xlf95
configure:5566: result: no
configure:5537: checking for ifc
configure:5566: result: no
configure:5537: checking for efc
configure:5566: result: no
configure:5537: checking for pgf95
configure:5566: result: no
configure:5537: checking for lf95
configure:5566: result: no
configure:5537: checking for gfortran
configure:5566: result: no
configure:5578: checking for Fortran 77 compiler version
configure:5581: --version </dev/null >&5
./configure: line 5582: --version: command not found
configure:5584: $? = 127
configure:5586: -v </dev/null >&5
./configure: line 5587: -v: command not found
configure:5589: $? = 127
configure:5591: -V </dev/null >&5
./configure: line 5592: -V: command not found
configure:5594: $? = 127
configure:5602: checking whether we are using the GNU Fortran 77 compiler
configure:5616: -c conftest.F >&5
./configure: line 5617: -c: command not found
configure:5622: $? = 127
configure: failed program was:
| program main
| #ifndef __GNUC__
| choke me
| #endif
|
| end
configure:5648: result: no
configure:5654: checking whether accepts -g
configure:5666: -c -g conftest.f >&5
./configure: line 5667: -c: command not found
configure:5672: $? = 127
configure: failed program was:
| program main
|
| end
configure:5697: result: no
configure:5727: checking the maximum length of command line arguments
configure:5819: result: 32768
configure:5830: checking command to parse /usr/bin/nm -B output from gcc object
configure:5926: gcc -c -g -O2 conftest.c >&5
configure:5929: $? = 0
configure:5933: /usr/bin/nm -B conftest.o \| sed -n -e 's/^.*[ ]\([ABCDGIRSTW][ABCDGIRSTW]*\)[ ][ ]*\([_A-Za-z][_A-Za-z0-9]*\)$/\1 \2 \2/p' \> conftest.nm
configure:5936: $? = 0
configure:5988: gcc -o conftest -g -O2 conftest.c conftstm.o >&5
configure:5991: $? = 0
configure:6029: result: ok
configure:6033: checking for objdir
configure:6048: result: .libs
configure:6138: checking for ar
configure:6154: found /usr/bin/ar
configure:6165: result: ar
configure:6218: checking for ranlib
configure:6234: found /usr/bin/ranlib
configure:6245: result: ranlib
configure:6298: checking for strip
configure:6314: found /usr/bin/strip
configure:6325: result: strip
configure:6612: checking if gcc static flag works
configure:6640: result: yes
configure:6658: checking if gcc supports -fno-rtti -fno-exceptions
configure:6676: gcc -c -g -O2 -fno-rtti -fno-exceptions conftest.c >&5
cc1: warning: "-fno-rtti" is valid for C++ but not for C/ObjC
configure:6680: $? = 0
configure:6693: result: no
configure:6708: checking for gcc option to produce PIC
configure:6912: result: -fPIC
configure:6920: checking if gcc PIC flag -fPIC works
configure:6938: gcc -c -g -O2 -fPIC -DPIC conftest.c >&5
configure:6942: $? = 0
configure:6955: result: yes
configure:6979: checking if gcc supports -c -o file.o
configure:7000: gcc -c -g -O2 -o out/conftest2.o conftest.c >&5
configure:7004: $? = 0
configure:7026: result: yes
configure:7052: checking whether the gcc linker (/usr/bin/ld) supports shared libraries
configure:7948: result: yes
configure:7974: checking whether -lc should be explicitly linked in
configure:7979: gcc -c -g -O2 conftest.c >&5
configure:7982: $? = 0
configure:7996: gcc -shared conftest.o -v -Wl,-soname -Wl,conftest -o conftest 2\>\&1 \| grep -lc \>/dev/null 2\>\&1
configure:7999: $? = 0
configure:8011: result: no
configure:8019: checking dynamic linker characteristics
configure:8586: result: GNU/Linux ld.so
configure:8590: checking how to hardcode library paths into programs
configure:8615: result: immediate
configure:8629: checking whether stripping libraries is possible
configure:8634: result: yes
configure:9464: checking if libtool supports shared libraries
configure:9466: result: yes
configure:9469: checking whether to build shared libraries
configure:9490: result: yes
configure:9493: checking whether to build static libraries
configure:9497: result: no
configure:9589: creating libtool
configure:10167: checking for ld used by g++
configure:10234: result: /usr/bin/ld
configure:10243: checking if the linker (/usr/bin/ld) is GNU ld
configure:10258: result: yes
configure:10309: checking whether the g++ linker (/usr/bin/ld) supports shared libraries
configure:11196: result: yes
configure:11214: g++ -c -g -O2 conftest.cc >&5
configure:11217: $? = 0
configure:11313: checking for g++ option to produce PIC
configure:11581: result: -fPIC
configure:11589: checking if g++ PIC flag -fPIC works
configure:11607: g++ -c -g -O2 -fPIC -DPIC conftest.cc >&5
configure:11611: $? = 0
configure:11624: result: yes
configure:11648: checking if g++ supports -c -o file.o
configure:11669: g++ -c -g -O2 -o out/conftest2.o conftest.cc >&5
configure:11673: $? = 0
configure:11695: result: yes
configure:11721: checking whether the g++ linker (/usr/bin/ld) supports shared libraries
configure:11746: result: yes
configure:11817: checking dynamic linker characteristics
configure:12384: result: GNU/Linux ld.so
configure:12388: checking how to hardcode library paths into programs
configure:12413: result: immediate
configure:12427: checking whether stripping libraries is possible
configure:12432: result: yes
configure:19989: checking for special C compiler options needed for large files
configure:20088: result: no
configure:20094: checking for _FILE_OFFSET_BITS value needed for large files
configure:20125: gcc -c -g -O2 conftest.c >&5
conftest.c:30: warning: left shift count >= width of type
conftest.c:30: warning: left shift count >= width of type
conftest.c:32: error: size of array `off_t_is_large' is negative
configure:20131: $? = 1
configure: failed program was:
| /* confdefs.h. */
|
| #define PACKAGE_NAME "gtk+"
| #define PACKAGE_TARNAME "gtk+"
| #define PACKAGE_VERSION "2.6.8"
| #define PACKAGE_STRING "gtk+ 2.6.8"
| #define PACKAGE_BUGREPORT "http://bugzilla.gnome.org/enter_bug.cgi?product=gtk%2B"
| #define GETTEXT_PACKAGE "gtk20"
| #define STDC_HEADERS 1
| #define HAVE_SYS_TYPES_H 1
| #define HAVE_SYS_STAT_H 1
| #define HAVE_STDLIB_H 1
| #define HAVE_STRING_H 1
| #define HAVE_MEMORY_H 1
| #define HAVE_STRINGS_H 1
| #define HAVE_INTTYPES_H 1
| #define HAVE_STDINT_H 1
| #define HAVE_UNISTD_H 1
| #define HAVE_DLFCN_H 1
| #ifdef __cplusplus
| extern "C" void std::exit (int) throw (); using std::exit;
| #endif
| /* end confdefs.h. */
| #include <sys/types.h>
| /* Check that off_t can represent 2**63 - 1 correctly.
| We can't simply define LARGE_OFF_T to be 9223372036854775807,
| since some C++ compilers masquerading as C compilers
| incorrectly reject 9223372036854775807. */
| #define LARGE_OFF_T (((off_t) 1 << 62) - 1 + ((off_t) 1 << 62))
| int off_t_is_large[(LARGE_OFF_T % 2147483629 == 721
| && LARGE_OFF_T % 2147483647 == 1)
| ? 1 : -1];
| int
| main ()
| {
|
| ;
| return 0;
| }
configure:20178: gcc -c -g -O2 conftest.c >&5
configure:20184: $? = 0
configure:20188: test -z
|| test ! -s conftest.err
configure:20191: $? = 0
configure:20194: test -s conftest.o
configure:20197: $? = 0
configure:20209: result: 64
configure:20219: checking for _LARGE_FILES value needed for large files
configure:20250: gcc -c -g -O2 conftest.c >&5
configure:20256: $? = 0
configure:20260: test -z
|| test ! -s conftest.err
configure:20263: $? = 0
configure:20266: test -s conftest.o
configure:20269: $? = 0
configure:20334: result: no
configure:20356: checking for nm
configure:20387: result: /usr/bin/nm -B
configure:20395: checking whether to enable maintainer-specific portions of Makefiles
configure:20404: result: no
configure:20420: checking for some Win32 platform
configure:20430: result: no
configure:20650: checking whether build environment is sane
configure:20693: result: yes
configure:20697: checking for library containing strerror
configure:20727: gcc -o conftest -g -O2 conftest.c >&5
configure:20733: $? = 0
configure:20737: test -z
|| test ! -s conftest.err
configure:20740: $? = 0
configure:20743: test -s conftest
configure:20746: $? = 0
configure:20816: result: none required
configure:20826: checking for gcc option to accept ANSI C
configure:20889: gcc -c -g -O2 conftest.c >&5
configure:20895: $? = 0
configure:20899: test -z
|| test ! -s conftest.err
configure:20902: $? = 0
configure:20905: test -s conftest.o
configure:20908: $? = 0
configure:20923: result: none needed
configure:20947: checking for a BSD-compatible install
configure:21002: result: /usr/bin/install -c
configure:21013: checking whether make sets $(MAKE)
configure:21033: result: yes
configure:21116: checking for pkg-config
configure:21134: found /usr/bin/pkg-config
configure:21147: result: /usr/bin/pkg-config
configure:21164: checking for glib-2.0 >= 2.6.0 atk >= 1.0.1 pango >= 1.8.0
configure:21168: result: yes
configure:21172: checking BASE_DEPENDENCIES_CFLAGS
configure:21175: result: -I/usr/local/include/glib-2.0 -I/usr/local/lib/glib-2.0/include -I/usr/local/include/atk-1.0 -I/usr/local/include/pango-1.0
configure:21178: checking BASE_DEPENDENCIES_LIBS
configure:21181: result: -L/usr/local/lib -latk-1.0 -lpango-1.0 -lgobject-2.0 -lgmodule-2.0 -ldl -lglib-2.0
configure:21228: checking Whether to write dependencies into .pc files
configure:21246: result: no
configure:21267: checking for perl5
configure:21300: result: no
configure:21267: checking for perl
configure:21285: found /usr/bin/perl
configure:21297: result: /usr/bin/perl
configure:21311: checking for indent
configure:21340: result: no
configure:21359: checking for lstat
configure:21416: gcc -o conftest -g -O2 -Wall conftest.c >&5
configure:21422: $? = 0
configure:21426: test -z
|| test ! -s conftest.err
configure:21429: $? = 0
configure:21432: test -s conftest
configure:21435: $? = 0
configure:21447: result: yes
configure:21359: checking for mkstemp
configure:21416: gcc -o conftest -g -O2 -Wall conftest.c >&5
configure:21422: $? = 0
configure:21426: test -z
|| test ! -s conftest.err
configure:21429: $? = 0
configure:21432: test -s conftest
configure:21435: $? = 0
configure:21447: result: yes
configure:21359: checking for flockfile
configure:21416: gcc -o conftest -g -O2 -Wall conftest.c >&5
configure:21422: $? = 0
configure:21426: test -z
|| test ! -s conftest.err
configure:21429: $? = 0
configure:21432: test -s conftest
configure:21435: $? = 0
configure:21447: result: yes
configure:21459: checking for sigsetjmp
configure:21480: gcc -o conftest -g -O2 -Wall conftest.c >&5
configure:21486: $? = 0
configure:21490: test -z
|| test ! -s conftest.err
configure:21493: $? = 0
configure:21496: test -s conftest
configure:21499: $? = 0
configure:21510: result: yes
configure:21541: checking locale.h usability
configure:21553: gcc -c -g -O2 -Wall conftest.c >&5
configure:21559: $? = 0
configure:21563: test -z
|| test ! -s conftest.err
configure:21566: $? = 0
configure:21569: test -s conftest.o
configure:21572: $? = 0
configure:21582: result: yes
configure:21586: checking locale.h presence
configure:21596: gcc -E conftest.c
configure:21602: $? = 0
configure:21622: result: yes
configure:21657: checking for locale.h
configure:21664: result: yes
configure:21678: checking for LC_MESSAGES
configure:21699: gcc -o conftest -g -O2 -Wall conftest.c >&5
configure:21705: $? = 0
configure:21709: test -z
|| test ! -s conftest.err
configure:21712: $? = 0
configure:21715: test -s conftest
configure:21718: $? = 0
configure:21730: result: yes
configure:21759: checking libintl.h usability
configure:21771: gcc -c -g -O2 -Wall conftest.c >&5
configure:21777: $? = 0
configure:21781: test -z
|| test ! -s conftest.err
configure:21784: $? = 0
configure:21787: test -s conftest.o
configure:21790: $? = 0
configure:21800: result: yes
configure:21804: checking libintl.h presence
configure:21814: gcc -E conftest.c
configure:21820: $? = 0
configure:21840: result: yes
configure:21875: checking for libintl.h
configure:21882: result: yes
configure:21893: checking for ngettext in libc
configure:21916: gcc -o conftest -g -O2 -Wall conftest.c >&5
configure:21922: $? = 0
configure:21926: test -z
|| test ! -s conftest.err
configure:21929: $? = 0
configure:21932: test -s conftest
configure:21935: $? = 0
configure:21948: result: yes
configure:21952: checking for dgettext in libc
configure:21975: gcc -o conftest -g -O2 -Wall conftest.c >&5
configure:21981: $? = 0
configure:21985: test -z
|| test ! -s conftest.err
configure:21988: $? = 0
configure:21991: test -s conftest
configure:21994: $? = 0
configure:22007: result: yes
configure:22016: checking for bind_textdomain_codeset
configure:22073: gcc -o conftest -g -O2 -Wall conftest.c >&5
configure:22079: $? = 0
configure:22083: test -z
|| test ! -s conftest.err
configure:22086: $? = 0
configure:22089: test -s conftest
configure:22092: $? = 0
configure:22104: result: yes
configure:22614: checking for msgfmt
configure:22641: result: /usr/bin/msgfmt
configure:22654: checking for dcgettext
configure:22711: gcc -o conftest -g -O2 -Wall conftest.c >&5
configure:22717: $? = 0
configure:22721: test -z
|| test ! -s conftest.err
configure:22724: $? = 0
configure:22727: test -s conftest
configure:22730: $? = 0
configure:22742: result: yes
configure:22754: checking for gmsgfmt
configure:22785: result: /usr/bin/msgfmt
configure:22794: checking for xgettext
configure:22821: result: /usr/bin/xgettext
configure:22845: gcc -o conftest -g -O2 -Wall conftest.c >&5
configure:22851: $? = 0
configure:22855: test -z
|| test ! -s conftest.err
configure:22858: $? = 0
configure:22861: test -s conftest
configure:22864: $? = 0
configure:23037: checking for catalogs to be installed
configure:23062: result: af am ar az az_IR be bg bn br bs ca cs cy da de el en_CA en_GB es et eu fa fi fr ga gl gu he hi hr hu ia id is it ja ko li lt lv mi mk ml mn mr ms nb ne nl nn no nso pa pl pt pt_BR ro ru rw sk sl sq sr sr@ije sr@Latn sv ta th tk tr uk uz uz@Latn vi wa xh yi zh_CN zh_TW
configure:23116: checking for extra flags to get ANSI library prototypes
configure:23136: gcc -o conftest -g -O2 -Wall conftest.c -lm >&5
configure:23139: $? = 0
configure:23141: ./conftest
configure:23144: $? = 0
configure:23146: result: none needed
configure:23201: checking for the BeOS
configure:23210: result: no
configure:23215: checking for extra flags for POSIX compliance
configure:23233: gcc -c -g -O2 -Wall conftest.c >&5
conftest.c: In function `main':
conftest.c:41: warning: unused variable `dir'
configure:23239: $? = 0
configure:23243: test -z
|| test ! -s conftest.err
configure:23246: $? = 0
configure:23249: test -s conftest.o
configure:23252: $? = 0
configure:23254: result: none needed
configure:23350: checking for pkg-config
configure:23381: result: /usr/bin/pkg-config
configure:23404: checking for GLIB - version >= 2.6.0
configure:23523: gcc -o conftest -g -O2 -Wall -pthread -I/usr/local/include/glib-2.0 -I/usr/local/lib/glib-2.0/include conftest.c -pthread -L/usr/local/lib -lgobject-2.0 -lgmodule-2.0 -ldl -lgthread-2.0 -lglib-2.0 >&5
configure:23526: $? = 0
configure:23528: ./conftest
configure:23531: $? = 0
configure:23549: result: yes (version 2.6.5)
configure:23656: checking for bind_textdomain_codeset
configure:23744: result: yes
configure:23770: checking pwd.h usability
configure:23782: gcc -c -g -O2 -Wall conftest.c >&5
configure:23788: $? = 0
configure:23792: test -z
|| test ! -s conftest.err
configure:23795: $? = 0
configure:23798: test -s conftest.o
configure:23801: $? = 0
configure:23811: result: yes
configure:23815: checking pwd.h presence
configure:23825: gcc -E conftest.c
configure:23831: $? = 0
configure:23851: result: yes
configure:23886: checking for pwd.h
configure:23893: result: yes
configure:23923: checking sys/time.h usability
configure:23935: gcc -c -g -O2 -Wall conftest.c >&5
configure:23941: $? = 0
configure:23945: test -z
|| test ! -s conftest.err
configure:23948: $? = 0
configure:23951: test -s conftest.o
configure:23954: $? = 0
configure:23964: result: yes
configure:23968: checking sys/time.h presence
configure:23978: gcc -E conftest.c
configure:23984: $? = 0
configure:24004: result: yes
configure:24039: checking for sys/time.h
configure:24046: result: yes
configure:24067: checking for unistd.h
configure:24072: result: yes
configure:24405: checking for ANSI C header files
configure:24561: result: yes
configure:24573: checking for an ANSI C-conforming const
configure:24640: gcc -c -g -O2 -Wall conftest.c >&5
conftest.c: In function `main':
conftest.c:72: warning: unused variable `s'
conftest.c:92: warning: unused variable `foo'
conftest.c:53: warning: unused variable `x'
conftest.c:59: warning: unused variable `zero'
conftest.c:71: warning: `t' might be used uninitialized in this function
conftest.c:89: warning: `b' might be used uninitialized in this function
configure:24646: $? = 0
configure:24650: test -z
|| test ! -s conftest.err
configure:24653: $? = 0
configure:24656: test -s conftest.o
configure:24659: $? = 0
configure:24670: result: yes
configure:24682: checking return type of signal handlers
configure:24713: gcc -c -g -O2 -Wall conftest.c >&5
conftest.c: In function `main':
conftest.c:59: warning: unused variable `i'
configure:24719: $? = 0
configure:24723: test -z
|| test ! -s conftest.err
configure:24726: $? = 0
configure:24729: test -s conftest.o
configure:24732: $? = 0
configure:24743: result: void
configure:24757: checking for stdlib.h
configure:24762: result: yes
configure:24757: checking for unistd.h
configure:24762: result: yes
configure:24906: checking for getpagesize
configure:24963: gcc -o conftest -g -O2 -Wall conftest.c >&5
configure:24969: $? = 0
configure:24973: test -z
|| test ! -s conftest.err
configure:24976: $? = 0
configure:24979: test -s conftest
configure:24982: $? = 0
configure:24994: result: yes
configure:25004: checking for working mmap
configure:25146: gcc -o conftest -g -O2 -Wall conftest.c >&5
configure:25149: $? = 0
configure:25151: ./conftest
configure:25154: $? = 0
configure:25168: result: yes
configure:25184: checking for mallinfo
configure:25241: gcc -o conftest -g -O2 -Wall conftest.c >&5
configure:25247: $? = 0
configure:25251: test -z
|| test ! -s conftest.err
configure:25254: $? = 0
configure:25257: test -s conftest
configure:25260: $? = 0
configure:25272: result: yes
configure:25286: checking for getresuid
configure:25343: gcc -o conftest -g -O2 -Wall conftest.c >&5
configure:25349: $? = 0
configure:25353: test -z
|| test ! -s conftest.err
configure:25356: $? = 0
configure:25359: test -s conftest
configure:25362: $? = 0
configure:25374: result: yes
configure:25384: checking for uid_t in sys/types.h
configure:25407: result: yes
configure:25424: checking for fd_set
configure:25442: gcc -c -g -O2 -Wall conftest.c >&5
conftest.c: In function `main':
conftest.c:56: warning: unused variable `readMask'
conftest.c:56: warning: unused variable `writeMask'
configure:25448: $? = 0
configure:25452: test -z
|| test ! -s conftest.err
configure:25455: $? = 0
configure:25458: test -s conftest.o
configure:25461: $? = 0
configure:25472: result: yes, found in sys/types.h
configure:25508: checking for wchar.h
configure:25518: gcc -E conftest.c
configure:25524: $? = 0
configure:25551: result: yes
configure:25555: checking for wctype.h
configure:25565: gcc -E conftest.c
configure:25571: $? = 0
configure:25598: result: yes
configure:25603: checking for iswalnum
configure:25660: gcc -o conftest -g -O2 -Wall conftest.c >&5
configure:25666: $? = 0
configure:25670: test -z
|| test ! -s conftest.err
configure:25673: $? = 0
configure:25676: test -s conftest
configure:25679: $? = 0
configure:25691: result: yes
configure:25770: checking if iswalnum() and friends are properly defined
configure:25801: gcc -o conftest -g -O2 -Wall conftest.c >&5
configure:25807: $? = 0
configure:25811: test -z
|| test ! -s conftest.err
configure:25814: $? = 0
configure:25817: test -s conftest
configure:25820: $? = 0
configure:25841: result: yes
configure:25846: checking for uxtheme.h
configure:25856: gcc -E conftest.c
conftest.c:54:21: uxtheme.h: No such file or directory
configure:25862: $? = 1
configure: failed program was:
| /* confdefs.h. */
|
| #define PACKAGE_NAME "gtk+"
| #define PACKAGE_TARNAME "gtk+"
| #define PACKAGE_VERSION "2.6.8"
| #define PACKAGE_STRING "gtk+ 2.6.8"
| #define PACKAGE_BUGREPORT "http://bugzilla.gnome.org/enter_bug.cgi?product=gtk%2B"
| #define GETTEXT_PACKAGE "gtk20"
| #define STDC_HEADERS 1
| #define HAVE_SYS_TYPES_H 1
| #define HAVE_SYS_STAT_H 1
| #define HAVE_STDLIB_H 1
| #define HAVE_STRING_H 1
| #define HAVE_MEMORY_H 1
| #define HAVE_STRINGS_H 1
| #define HAVE_INTTYPES_H 1
| #define HAVE_STDINT_H 1
| #define HAVE_UNISTD_H 1
| #define HAVE_DLFCN_H 1
| #ifdef __cplusplus
| extern "C" void std::exit (int) throw (); using std::exit;
| #endif
| #define _FILE_OFFSET_BITS 64
| #define GTK_COMPILED_WITH_DEBUGGING "minimum"
| #define HAVE_LSTAT 1
| #define HAVE_MKSTEMP 1
| #define HAVE_FLOCKFILE 1
| #define HAVE_SIGSETJMP 1
| #define HAVE_LOCALE_H 1
| #define HAVE_LC_MESSAGES 1
| #define HAVE_BIND_TEXTDOMAIN_CODESET 1
| #define HAVE_GETTEXT 1
| #define HAVE_DCGETTEXT 1
| #define ENABLE_NLS 1
| #define GTK_LOCALEDIR "/usr/local/share/locale"
| #define HAVE_BIND_TEXTDOMAIN_CODESET 1
| #define HAVE_PWD_H 1
| #define HAVE_PWD_H 1
| #define HAVE_SYS_TIME_H 1
| #define HAVE_SYS_TIME_H 1
| #define HAVE_UNISTD_H 1
| #define HAVE_UNISTD_H 1
| #define STDC_HEADERS 1
| #define RETSIGTYPE void
| #define HAVE_STDLIB_H 1
| #define HAVE_UNISTD_H 1
| #define HAVE_GETPAGESIZE 1
| #define HAVE_MMAP 1
| #define HAVE_MALLINFO 1
| #define HAVE_GETRESUID 1
| #define HAVE_WCHAR_H 1
| #define HAVE_WCTYPE_H 1
| /* end confdefs.h. */
| #include <uxtheme.h>
configure:25889: result: no
configure:25912: checking whether to build gmodulized gdk-pixbuf
configure:25927: result: yes
configure:25929: checking whether dynamic modules work
configure:25954: result: yes
configure:25983: checking for TIFFReadScanline in -ltiff
configure:26013: gcc -o conftest -g -O2 -Wall conftest.c -ltiff -lm >&5
configure:26019: $? = 0
configure:26023: test -z
|| test ! -s conftest.err
configure:26026: $? = 0
configure:26029: test -s conftest
configure:26032: $? = 0
configure:26045: result: yes
configure:26058: checking tiffio.h usability
configure:26070: gcc -c -g -O2 -Wall conftest.c >&5
configure:26076: $? = 0
configure:26080: test -z
|| test ! -s conftest.err
configure:26083: $? = 0
configure:26086: test -s conftest.o
configure:26089: $? = 0
configure:26099: result: yes
configure:26103: checking tiffio.h presence
configure:26113: gcc -E conftest.c
configure:26119: $? = 0
configure:26139: result: yes
configure:26174: checking for tiffio.h
configure:26181: result: yes
configure:26639: checking for jpeg_destroy_decompress in -ljpeg
configure:26669: gcc -o conftest -g -O2 -Wall conftest.c -ljpeg >&5
configure:26675: $? = 0
configure:26679: test -z
|| test ! -s conftest.err
configure:26682: $? = 0
configure:26685: test -s conftest
configure:26688: $? = 0
configure:26701: result: yes
configure:26712: checking for jpeglib.h
configure:26726: gcc -E conftest.c
configure:26732: $? = 0
configure:26752: result: yes
configure:26756: checking for jpeg_simple_progression in -ljpeg
configure:26786: gcc -o conftest -g -O2 -Wall conftest.c -ljpeg >&5
configure:26792: $? = 0
configure:26796: test -z
|| test ! -s conftest.err
configure:26799: $? = 0
configure:26802: test -s conftest
configure:26805: $? = 0
configure:26818: result: yes
configure:26850: checking for libpng12
configure:26853: result: yes
configure:27170: checking pixbuf loaders to build
configure:27198: result:
configure:27221: checking for sys/wait.h that is POSIX.1 compatible
configure:27252: gcc -c -g -O2 -Wall conftest.c >&5
configure:27258: $? = 0
configure:27262: test -z
|| test ! -s conftest.err
configure:27265: $? = 0
configure:27268: test -s conftest.o
configure:27271: $? = 0
configure:27282: result: yes
configure:27293: checking return type of signal handlers
configure:27354: result: void
configure:27415: checking for x86 platform
configure:27424: result: yes
configure:27432: checking compiler support for MMX
configure:27435: gcc -c -g -O2 -Wall conftest.S >&5
configure:27438: $? = 0
configure:27451: result: yes
configure:27578: checking for freetype-config
configure:27596: found /usr/bin/freetype-config
configure:27609: result: /usr/bin/freetype-config
configure:27645: gcc -o conftest -g -O2 -Wall conftest.c -lfreetype -lz >&5
configure:27651: $? = 0
configure:27655: test -z
|| test ! -s conftest.err
configure:27658: $? = 0
configure:27661: test -s conftest
configure:27664: $? = 0
configure:27681: checking For sufficiently new FreeType (at least 2.0.1)
configure:27703: gcc -c -g -O2 -Wall -I/usr/include/freetype2 conftest.c >&5
configure:27709: $? = 0
configure:27713: test -z
|| test ! -s conftest.err
configure:27716: $? = 0
configure:27719: test -s conftest.o
configure:27722: $? = 0
configure:27733: result: yes
configure:27786: checking for X
configure:28016: result: libraries /usr/X11R6/lib, headers /usr/X11R6/include
configure:28188: gcc -o conftest -g -O2 -Wall conftest.c -L/usr/X11R6/lib -lX11 >&5
configure:28194: $? = 0
configure:28198: test -z
|| test ! -s conftest.err
configure:28201: $? = 0
configure:28204: test -s conftest
configure:28207: $? = 0
configure:28365: checking for gethostbyname
configure:28422: gcc -o conftest -g -O2 -Wall conftest.c >&5
configure:28428: $? = 0
configure:28432: test -z
|| test ! -s conftest.err
configure:28435: $? = 0
configure:28438: test -s conftest
configure:28441: $? = 0
configure:28453: result: yes
configure:28604: checking for connect
configure:28661: gcc -o conftest -g -O2 -Wall conftest.c >&5
configure:28667: $? = 0
configure:28671: test -z
|| test ! -s conftest.err
configure:28674: $? = 0
configure:28677: test -s conftest
configure:28680: $? = 0
configure:28692: result: yes
configure:28767: checking for remove
configure:28824: gcc -o conftest -g -O2 -Wall conftest.c >&5
configure:28830: $? = 0
configure:28834: test -z
|| test ! -s conftest.err
configure:28837: $? = 0
configure:28840: test -s conftest
configure:28843: $? = 0
configure:28855: result: yes
configure:28930: checking for shmat
configure:28987: gcc -o conftest -g -O2 -Wall conftest.c >&5
configure:28993: $? = 0
configure:28997: test -z
|| test ! -s conftest.err
configure:29000: $? = 0
configure:29003: test -s conftest
configure:29006: $? = 0
configure:29018: result: yes
configure:29102: checking for IceConnectionNumber in -lICE
configure:29132: gcc -o conftest -g -O2 -Wall -L/usr/X11R6/lib conftest.c -lICE >&5
configure:29138: $? = 0
configure:29142: test -z
|| test ! -s conftest.err
configure:29145: $? = 0
configure:29148: test -s conftest
configure:29151: $? = 0
configure:29164: result: yes
configure:29196: checking for XOpenDisplay in -lX11
configure:29226: gcc -o conftest -g -O2 -Wall conftest.c -lX11 -L/usr/X11R6/lib -lXft -lfreetype -lz -lXrender -lX11 -lfontconfig -lX11 >&5
/usr/X11R6/lib/libXrender.a(Xrender.o)(.text+0x11): In function `XRenderFindDisplay':
: undefined reference to `XextFindDisplay'
/usr/X11R6/lib/libXrender.a(Xrender.o)(.text+0x34): In function `XRenderFindDisplay':
: undefined reference to `XextAddDisplay'
/usr/X11R6/lib/libXrender.a(Xrender.o)(.text+0x71): In function `XRenderCloseDisplay':
: undefined reference to `XextRemoveDisplay'
/usr/X11R6/lib/libXrender.a(Xrender.o)(.text+0xe5): In function `XRenderQueryVersion':
: undefined reference to `XMissingExtension'
/usr/X11R6/lib/libXrender.a(Xrender.o)(.text+0x24b): In function `XRenderQueryFormats':
: undefined reference to `XMissingExtension'
/usr/X11R6/lib/libXrender.a(Xrender.o)(.text+0x64: In function `XRenderFindVisualFormat':
: undefined reference to `XMissingExtension'
/usr/X11R6/lib/libXrender.a(Xrender.o)(.text+0x6c4): In function `XRenderFindFormat':
: undefined reference to `XMissingExtension'
/usr/X11R6/lib/libXrender.a(Glyph.o)(.text+0x2b): In function `XRenderCreateGlyphSet':
: undefined reference to `XMissingExtension'
/usr/X11R6/lib/libXrender.a(Glyph.o)(.text+0xff): more undefined references to `XMissingExtension' follow
collect2: ld returned 1 exit status
configure:29232: $? = 1
configure: failed program was:
| /* confdefs.h. */
|
| #define PACKAGE_NAME "gtk+"
| #define PACKAGE_TARNAME "gtk+"
| #define PACKAGE_VERSION "2.6.8"
| #define PACKAGE_STRING "gtk+ 2.6.8"
| #define PACKAGE_BUGREPORT "http://bugzilla.gnome.org/enter_bug.cgi?product=gtk%2B"
| #define GETTEXT_PACKAGE "gtk20"
| #define STDC_HEADERS 1
| #define HAVE_SYS_TYPES_H 1
| #define HAVE_SYS_STAT_H 1
| #define HAVE_STDLIB_H 1
| #define HAVE_STRING_H 1
| #define HAVE_MEMORY_H 1
| #define HAVE_STRINGS_H 1
| #define HAVE_INTTYPES_H 1
| #define HAVE_STDINT_H 1
| #define HAVE_UNISTD_H 1
| #define HAVE_DLFCN_H 1
| #ifdef __cplusplus
| extern "C" void std::exit (int) throw (); using std::exit;
| #endif
| #define _FILE_OFFSET_BITS 64
| #define GTK_COMPILED_WITH_DEBUGGING "minimum"
| #define HAVE_LSTAT 1
| #define HAVE_MKSTEMP 1
| #define HAVE_FLOCKFILE 1
| #define HAVE_SIGSETJMP 1
| #define HAVE_LOCALE_H 1
| #define HAVE_LC_MESSAGES 1
| #define HAVE_BIND_TEXTDOMAIN_CODESET 1
| #define HAVE_GETTEXT 1
| #define HAVE_DCGETTEXT 1
| #define ENABLE_NLS 1
| #define GTK_LOCALEDIR "/usr/local/share/locale"
| #define HAVE_BIND_TEXTDOMAIN_CODESET 1
| #define HAVE_PWD_H 1
| #define HAVE_PWD_H 1
| #define HAVE_SYS_TIME_H 1
| #define HAVE_SYS_TIME_H 1
| #define HAVE_UNISTD_H 1
| #define HAVE_UNISTD_H 1
| #define STDC_HEADERS 1
| #define RETSIGTYPE void
| #define HAVE_STDLIB_H 1
| #define HAVE_UNISTD_H 1
| #define HAVE_GETPAGESIZE 1
| #define HAVE_MMAP 1
| #define HAVE_MALLINFO 1
| #define HAVE_GETRESUID 1
| #define HAVE_WCHAR_H 1
| #define HAVE_WCTYPE_H 1
| #define USE_GMODULE 1
| #define HAVE_PROGRESSIVE_JPEG 1
| #define HAVE_SYS_WAIT_H 1
| #define RETSIGTYPE void
| #define USE_MMX 1
| /* end confdefs.h. */
|
| /* Override any gcc2 internal prototype to avoid an error. */
| #ifdef __cplusplus
| extern "C"
| #endif
| /* We use char because int might match the return type of a gcc2
| builtin and then its argument prototype would still apply. */
| char XOpenDisplay ();
| int
| main ()
| {
| XOpenDisplay ();
| ;
| return 0;
| }
configure:29258: result: no
configure:29263: error: *** libX11 not found. Check 'config.log' for more details.

## ---------------- ##
## Cache variables. ##
## ---------------- ##

ac_cv_build=i686-pc-linux-gnu
ac_cv_build_alias=i686-pc-linux-gnu
ac_cv_c_compiler_gnu=yes
ac_cv_c_const=yes
ac_cv_cxx_compiler_gnu=yes
ac_cv_env_CC_set=
ac_cv_env_CC_value=
ac_cv_env_CFLAGS_set=
ac_cv_env_CFLAGS_value=
ac_cv_env_CPPFLAGS_set=
ac_cv_env_CPPFLAGS_value=
ac_cv_env_CPP_set=
ac_cv_env_CPP_value=
ac_cv_env_CXXCPP_set=
ac_cv_env_CXXCPP_value=
ac_cv_env_CXXFLAGS_set=
ac_cv_env_CXXFLAGS_value=
ac_cv_env_CXX_set=
ac_cv_env_CXX_value=
ac_cv_env_F77_set=
ac_cv_env_F77_value=
ac_cv_env_FFLAGS_set=
ac_cv_env_FFLAGS_value=
ac_cv_env_LDFLAGS_set=
ac_cv_env_LDFLAGS_value=
ac_cv_env_build_alias_set=
ac_cv_env_build_alias_value=
ac_cv_env_host_alias_set=
ac_cv_env_host_alias_value=
ac_cv_env_target_alias_set=
ac_cv_env_target_alias_value=
ac_cv_exeext=
ac_cv_f77_compiler_gnu=no
ac_cv_func_bind_textdomain_codeset=yes
ac_cv_func_connect=yes
ac_cv_func_dcgettext=yes
ac_cv_func_flockfile=yes
ac_cv_func_gethostbyname=yes
ac_cv_func_getpagesize=yes
ac_cv_func_getresuid=yes
ac_cv_func_iswalnum=yes
ac_cv_func_lstat=yes
ac_cv_func_mallinfo=yes
ac_cv_func_mkstemp=yes
ac_cv_func_mmap_fixed_mapped=yes
ac_cv_func_remove=yes
ac_cv_func_shmat=yes
ac_cv_have_x='have_x=yes ac_x_includes=/usr/X11R6/include ac_x_libraries=/usr/X11R6/lib'
ac_cv_header_dlfcn_h=yes
ac_cv_header_inttypes_h=yes
ac_cv_header_libintl_h=yes
ac_cv_header_locale_h=yes
ac_cv_header_memory_h=yes
ac_cv_header_pwd_h=yes
ac_cv_header_stdc=yes
ac_cv_header_stdint_h=yes
ac_cv_header_stdlib_h=yes
ac_cv_header_string_h=yes
ac_cv_header_strings_h=yes
ac_cv_header_sys_stat_h=yes
ac_cv_header_sys_time_h=yes
ac_cv_header_sys_types_h=yes
ac_cv_header_sys_wait_h=yes
ac_cv_header_tiffio_h=yes
ac_cv_header_unistd_h=yes
ac_cv_host=i686-pc-linux-gnu
ac_cv_host_alias=i686-pc-linux-gnu
ac_cv_lib_ICE_IceConnectionNumber=yes
ac_cv_lib_X11_XOpenDisplay=no
ac_cv_lib_jpeg_jpeg_destroy_decompress=yes
ac_cv_lib_jpeg_jpeg_simple_progression=yes
ac_cv_lib_tiff_TIFFReadScanline=yes
ac_cv_objext=o
ac_cv_path_FREETYPE_CONFIG=/usr/bin/freetype-config
ac_cv_path_GMSGFMT=/usr/bin/msgfmt
ac_cv_path_MSGFMT=/usr/bin/msgfmt
ac_cv_path_NM='/usr/bin/nm -B'
ac_cv_path_PERL=/usr/bin/perl
ac_cv_path_PKG_CONFIG=/usr/bin/pkg-config
ac_cv_path_XGETTEXT=/usr/bin/xgettext
ac_cv_path_install='/usr/bin/install -c'
ac_cv_prog_AWK=gawk
ac_cv_prog_CPP='gcc -E'
ac_cv_prog_CXXCPP='g++ -E'
ac_cv_prog_ac_ct_AR=ar
ac_cv_prog_ac_ct_CC=gcc
ac_cv_prog_ac_ct_CXX=g++
ac_cv_prog_ac_ct_RANLIB=ranlib
ac_cv_prog_ac_ct_STRIP=strip
ac_cv_prog_cc_g=yes
ac_cv_prog_cc_stdc=
ac_cv_prog_cxx_g=yes
ac_cv_prog_egrep='grep -E'
ac_cv_prog_f77_g=no
ac_cv_prog_make_make_set=yes
ac_cv_search_strerror='none required'
ac_cv_sys_file_offset_bits=64
ac_cv_sys_large_files=no
ac_cv_sys_largefile_CC=no
ac_cv_type_signal=void
ac_cv_type_uid_t=yes
am_cv_CC_dependencies_compiler_type=gcc3
am_cv_CXX_dependencies_compiler_type=gcc3
am_cv_prog_cc_stdc=
am_cv_val_LC_MESSAGES=yes
gt_cv_func_dgettext_libc=yes
gt_cv_func_dgettext_libintl=no
gt_cv_func_ngettext_libc=yes
gt_cv_have_gettext=yes
lt_cv_deplibs_check_method=pass_all
lt_cv_file_magic_cmd='$MAGIC_CMD'
lt_cv_file_magic_test_file=
lt_cv_ld_reload_flag=-r
lt_cv_objdir=.libs
lt_cv_path_LD=/usr/bin/ld
lt_cv_path_LDCXX=/usr/bin/ld
lt_cv_path_NM='/usr/bin/nm -B'
lt_cv_path_SED=/bin/sed
lt_cv_prog_compiler_c_o=yes
lt_cv_prog_compiler_c_o_CXX=yes
lt_cv_prog_compiler_rtti_exceptions=no
lt_cv_prog_gnu_ld=yes
lt_cv_prog_gnu_ldcxx=yes
lt_cv_sys_global_symbol_pipe='sed -n -e '\''s/^.*[ ]\([ABCDGIRSTW][ABCDGIRSTW]*\)[ ][ ]*\([_A-Za-z][_A-Za-z0-9]*\)$/\1 \2 \2/p'\'''
lt_cv_sys_global_symbol_to_c_name_address='sed -n -e '\''s/^: \([^ ]*\) $/ {\"\1\", (lt_ptr) 0},/p'\'' -e '\''s/^[BCDEGRST] \([^ ]*\) \([^ ]*\)$/ {"\2", (lt_ptr) \&\2},/p'\'''
lt_cv_sys_global_symbol_to_cdecl='sed -n -e '\''s/^. .* \(.*\)$/extern int \1;/p'\'''
lt_cv_sys_max_cmd_len=32768
lt_lt_cv_prog_compiler_c_o='"yes"'
lt_lt_cv_prog_compiler_c_o_CXX='"yes"'
lt_lt_cv_sys_global_symbol_pipe='"sed -n -e '\''s/^.*[ ]\\([ABCDGIRSTW][ABCDGIRSTW]*\\)[ ][ ]*\\([_A-Za-z][_A-Za-z0-9]*\\)\$/\\1 \\2 \\2/p'\''"'
lt_lt_cv_sys_global_symbol_to_c_name_address='"sed -n -e '\''s/^: \\([^ ]*\\) \$/ {\\\"\\1\\\", (lt_ptr) 0},/p'\'' -e '\''s/^[BCDEGRST] \\([^ ]*\\) \\([^ ]*\\)\$/ {\"\\2\", (lt_ptr) \\&\\2},/p'\''"'
lt_lt_cv_sys_global_symbol_to_cdecl='"sed -n -e '\''s/^. .* \\(.*\\)\$/extern int \\1;/p'\''"'

## ----------------- ##
## Output variables. ##
## ----------------- ##

ACLOCAL='${SHELL} /usr/local/gtk+-2.6.8/missing --run aclocal-1.7 '
AMDEPBACKSLASH='\'
AMDEP_FALSE='#'
AMDEP_TRUE=''
AMTAR='${SHELL} /usr/local/gtk+-2.6.8/missing --run tar'
AR='ar'
AS='as'
AUTOCONF='${SHELL} /usr/local/gtk+-2.6.8/missing --run autoconf'
AUTOHEADER='${SHELL} /usr/local/gtk+-2.6.8/missing --run autoheader'
AUTOMAKE='${SHELL} /usr/local/gtk+-2.6.8/missing --run automake-1.7'
AWK='gawk'
BASE_DEPENDENCIES_CFLAGS='-I/usr/local/include/glib-2.0 -I/usr/local/lib/glib-2.0/include -I/usr/local/include/atk-1.0 -I/usr/local/include/pango-1.0 '
BASE_DEPENDENCIES_LIBS='-L/usr/local/lib -latk-1.0 -lpango-1.0 -lgobject-2.0 -lgmodule-2.0 -ldl -lglib-2.0 '
BUILD_DYNAMIC_MODULES_FALSE='#'
BUILD_DYNAMIC_MODULES_TRUE=''
CATALOGS=' af.gmo am.gmo ar.gmo az.gmo az_IR.gmo be.gmo bg.gmo bn.gmo br.gmo bs.gmo ca.gmo cs.gmo cy.gmo da.gmo de.gmo el.gmo en_CA.gmo en_GB.gmo es.gmo et.gmo eu.gmo fa.gmo fi.gmo fr.gmo ga.gmo gl.gmo gu.gmo he.gmo hi.gmo hr.gmo hu.gmo ia.gmo id.gmo is.gmo it.gmo ja.gmo ko.gmo li.gmo lt.gmo lv.gmo mi.gmo mk.gmo ml.gmo mn.gmo mr.gmo ms.gmo nb.gmo ne.gmo nl.gmo nn.gmo no.gmo nso.gmo pa.gmo pl.gmo pt.gmo pt_BR.gmo ro.gmo ru.gmo rw.gmo sk.gmo sl.gmo sq.gmo sr.gmo sr@ije.gmo sr@Latn.gmo sv.gmo ta.gmo th.gmo tk.gmo tr.gmo uk.gmo uz.gmo uz@Latn.gmo vi.gmo wa.gmo xh.gmo yi.gmo zh_CN.gmo zh_TW.gmo'
CATOBJEXT='.gmo'
CC='gcc'
CCAS='$(CC)'
CCASFLAGS='$(CFLAGS)'
CCDEPMODE='depmode=gcc3'
CFLAGS='-g -O2 -Wall'
CPP='gcc -E'
CPPFLAGS=''
CROSS_COMPILING_FALSE=''
CROSS_COMPILING_TRUE='#'
CXX='g++'
CXXCPP='g++ -E'
CXXDEPMODE='depmode=gcc3'
CXXFLAGS='-g -O2'
CYGPATH_W='echo'
DATADIRNAME='share'
DB2HTML=''
DEFS=''
DEPDIR='.deps'
DISABLE_EXPLICIT_DEPS_FALSE='#'
DISABLE_EXPLICIT_DEPS_TRUE=''
DLLTOOL='dlltool'
ECHO='echo'
ECHO_C=''
ECHO_N='-n'
ECHO_T=''
EGREP='grep -E'
ENABLE_FB_MANAGER_FALSE=''
ENABLE_FB_MANAGER_TRUE=''
ENABLE_GTK_DOC_FALSE=''
ENABLE_GTK_DOC_TRUE=''
ENABLE_MAN_FALSE=''
ENABLE_MAN_TRUE=''
EXEEXT=''
F77=''
FFLAGS=''
FREETYPE_CFLAGS='-I/usr/include/freetype2'
FREETYPE_CONFIG='/usr/bin/freetype-config'
FREETYPE_LIBS='-lfreetype -lz'
GDK_DEP_CFLAGS=''
GDK_DEP_LIBS=''
GDK_EXTRA_CFLAGS=''
GDK_EXTRA_LIBS=''
GDK_PACKAGES=''
GDK_PIXBUF_CSOURCE=''
GDK_PIXBUF_DEP_CFLAGS='-pthread -I/usr/local/include/glib-2.0 -I/usr/local/lib/glib-2.0/include -I/usr/include/libpng12 '
GDK_PIXBUF_DEP_LIBS='-L/usr/local/lib -lgmodule-2.0 -ldl -lgobject-2.0 -lglib-2.0 -lm'
GDK_PIXBUF_EXTRA_CFLAGS=''
GDK_PIXBUF_EXTRA_LIBS=' -lm'
GDK_PIXBUF_MAJOR='2'
GDK_PIXBUF_MICRO='8'
GDK_PIXBUF_MINOR='6'
GDK_PIXBUF_PACKAGES='gmodule-no-export-2.0 gobject-2.0'
GDK_PIXBUF_VERSION='2.6.8'
GDK_PIXBUF_XLIB_DEP_CFLAGS=''
GDK_PIXBUF_XLIB_DEP_LIBS=''
GDK_PIXBUF_XLIB_EXTRA_CFLAGS=''
GDK_PIXBUF_XLIB_EXTRA_LIBS=''
GDK_PIXBUF_XLIB_PACKAGES=''
GDK_WIN32_EXTRA_CFLAGS=''
GDK_WLIBS=''
GETTEXT_PACKAGE='gtk20'
GLIB_CFLAGS='-pthread -I/usr/local/include/glib-2.0 -I/usr/local/lib/glib-2.0/include '
GLIB_GENMARSHAL='glib-genmarshal'
GLIB_LIBS='-pthread -L/usr/local/lib -lgobject-2.0 -lgmodule-2.0 -ldl -lgthread-2.0 -lglib-2.0 '
GLIB_MKENUMS='glib-mkenums'
GMOFILES=' af.gmo am.gmo ar.gmo az.gmo az_IR.gmo be.gmo bg.gmo bn.gmo br.gmo bs.gmo ca.gmo cs.gmo cy.gmo da.gmo de.gmo el.gmo en_CA.gmo en_GB.gmo es.gmo et.gmo eu.gmo fa.gmo fi.gmo fr.gmo ga.gmo gl.gmo gu.gmo he.gmo hi.gmo hr.gmo hu.gmo ia.gmo id.gmo is.gmo it.gmo ja.gmo ko.gmo li.gmo lt.gmo lv.gmo mi.gmo mk.gmo ml.gmo mn.gmo mr.gmo ms.gmo nb.gmo ne.gmo nl.gmo nn.gmo no.gmo nso.gmo pa.gmo pl.gmo pt.gmo pt_BR.gmo ro.gmo ru.gmo rw.gmo sk.gmo sl.gmo sq.gmo sr.gmo sr@ije.gmo sr@Latn.gmo sv.gmo ta.gmo th.gmo tk.gmo tr.gmo uk.gmo uz.gmo uz@Latn.gmo vi.gmo wa.gmo xh.gmo yi.gmo zh_CN.gmo zh_TW.gmo'
GMSGFMT='/usr/bin/msgfmt'
GOBJECT_QUERY='gobject-query'
GTK_API_VERSION='2.0'
GTK_BINARY_AGE='608'
GTK_BINARY_VERSION='2.4.0'
GTK_DEBUG_FLAGS='-DG_DISABLE_CAST_CHECKS'
GTK_DEP_CFLAGS=''
GTK_DEP_LIBS=''
GTK_DOC_USE_LIBTOOL_FALSE=''
GTK_DOC_USE_LIBTOOL_TRUE=''
GTK_EXTRA_CFLAGS=''
GTK_EXTRA_LIBS=''
GTK_INTERFACE_AGE='8'
GTK_MAJOR_VERSION='2'
GTK_MICRO_VERSION='8'
GTK_MINOR_VERSION='6'
GTK_PACKAGES=''
GTK_VERSION='2.6.8'
GTK_XIM_FLAGS=''
HAVE_DOCBOOK_FALSE=''
HAVE_DOCBOOK_TRUE=''
HAVE_IE55_FALSE=''
HAVE_IE55_TRUE='#'
HAVE_JPEG_FALSE='#'
HAVE_JPEG_TRUE=''
HAVE_PNG_FALSE='#'
HAVE_PNG_TRUE=''
HAVE_TIFF_FALSE='#'
HAVE_TIFF_TRUE=''
HAVE_WINTAB_FALSE=''
HAVE_WINTAB_TRUE='#'
HAVE_X11R6_FALSE=''
HAVE_X11R6_TRUE=''
HTML_DIR=''
IE55_UUID_LIB=''
INCLUDED_LOADER_DEFINE=''
INCLUDED_LOADER_OBJ=''
INDENT=''
INSTALL_DATA='${INSTALL} -m 644'
INSTALL_PROGRAM='${INSTALL}'
INSTALL_SCRIPT='${INSTALL}'
INSTALL_STRIP_PROGRAM='${SHELL} $(install_sh) -c -s'
INSTOBJEXT='.mo'
INTLLIBS=''
LDFLAGS=''
LIBJPEG='-ljpeg'
LIBOBJS=''
LIBPNG='-lpng12 '
LIBS=' '
LIBTIFF='-ltiff'
LIBTOOL='$(SHELL) $(top_builddir)/libtool'
LIBTOOL_EXPORT_OPTIONS='-export-symbols-regex "^[^_].*"'
LN_S='ln -s'
LTLIBOBJS=''
LT_CURRENT_MINUS_AGE='0'
LT_VERSION_INFO='600:8:600'
MAINT='#'
MAINTAINER_MODE_FALSE=''
MAINTAINER_MODE_TRUE='#'
MAKEINFO='${SHELL} /usr/local/gtk+-2.6.8/missing --run makeinfo'
MKINSTALLDIRS='./mkinstalldirs'
MSGFMT='/usr/bin/msgfmt'
MS_LIB_AVAILABLE_FALSE=''
MS_LIB_AVAILABLE_TRUE='#'
NM='/usr/bin/nm -B'
OBJDUMP='objdump'
OBJEXT='o'
OS_LINUX_FALSE='#'
OS_LINUX_TRUE=''
OS_UNIX_FALSE='#'
OS_UNIX_TRUE=''
OS_WIN32_FALSE=''
OS_WIN32_TRUE='#'
PACKAGE='gtk+'
PACKAGE_BUGREPORT='http://bugzilla.gnome.org/enter_bug.cgi?product=gtk%2B'
PACKAGE_NAME='gtk+'
PACKAGE_STRING='gtk+ 2.6.8'
PACKAGE_TARNAME='gtk+'
PACKAGE_VERSION='2.6.8'
PATH_SEPARATOR=':'
PERL='/usr/bin/perl'
PKG_CONFIG='/usr/bin/pkg-config'
PLATFORM_WIN32_FALSE=''
PLATFORM_WIN32_TRUE='#'
POFILES=' af.po am.po ar.po az.po az_IR.po be.po bg.po bn.po br.po bs.po ca.po cs.po cy.po da.po de.po el.po en_CA.po en_GB.po es.po et.po eu.po fa.po fi.po fr.po ga.po gl.po gu.po he.po hi.po hr.po hu.po ia.po id.po is.po it.po ja.po ko.po li.po lt.po lv.po mi.po mk.po ml.po mn.po mr.po ms.po nb.po ne.po nl.po nn.po no.po nso.po pa.po pl.po pt.po pt_BR.po ro.po ru.po rw.po sk.po sl.po sq.po sr.po sr@ije.po sr@Latn.po sv.po ta.po th.po tk.po tr.po uk.po uz.po uz@Latn.po vi.po wa.po xh.po yi.po zh_CN.po zh_TW.po'
POSUB='po'
PO_IN_DATADIR_FALSE=''
PO_IN_DATADIR_TRUE=''
RANLIB='ranlib'
REBUILD=''
REBUILD_PNGS=''
SET_MAKE=''
SHELL='/bin/sh'
STRIP='strip'
USE_LINUX_FB_FALSE=''
USE_LINUX_FB_TRUE=''
USE_MMX_FALSE='#'
USE_MMX_TRUE=''
USE_NLS='yes'
USE_WIN32_FALSE=''
USE_WIN32_TRUE=''
USE_X11_FALSE=''
USE_X11_TRUE=''
VERSION='2.6.8'
WINTAB_LIB=''
XCURSOR_CFLAGS=''
XCURSOR_LIBS=''
XFIXES_CFLAGS=''
XFIXES_LIBS=''
XGETTEXT='/usr/bin/xgettext'
XINPUT_XFREE_FALSE=''
XINPUT_XFREE_TRUE=''
XMLCATALOG=''
XML_CATALOG_FILE=''
XSLTPROC=''
X_CFLAGS=' -I/usr/X11R6/include'
X_EXTRA_LIBS=''
X_LIBS=' -L/usr/X11R6/lib'
X_PRE_LIBS=' -lSM -lICE'
ac_ct_AR='ar'
ac_ct_AS=''
ac_ct_CC='gcc'
ac_ct_CXX='g++'
ac_ct_DLLTOOL=''
ac_ct_F77=''
ac_ct_OBJDUMP=''
ac_ct_RANLIB='ranlib'
ac_ct_STRIP='strip'
am__fastdepCC_FALSE='#'
am__fastdepCC_TRUE=''
am__fastdepCXX_FALSE='#'
am__fastdepCXX_TRUE=''
am__include='include'
am__leading_dot='.'
am__quote=''
bindir='${exec_prefix}/bin'
build='i686-pc-linux-gnu'
build_alias=''
build_cpu='i686'
build_os='linux-gnu'
build_vendor='pc'
datadir='${prefix}/share'
exec_prefix='NONE'
gdktarget='x11'
gdktargetlib='libgdk-x11-2.0.la'
gtktargetlib='libgtk-x11-2.0.la'
host='i686-pc-linux-gnu'
host_alias=''
host_cpu='i686'
host_os='linux-gnu'
host_vendor='pc'
includedir='${prefix}/include'
infodir='${prefix}/info'
install_sh='/usr/local/gtk+-2.6.8/install-sh'
libdir='${exec_prefix}/lib'
libexecdir='${exec_prefix}/libexec'
localstatedir='${prefix}/var'
mandir='${prefix}/man'
ms_librarian=''
oldincludedir='/usr/include'
prefix='NONE'
program_transform_name='s,x,x,'
sbindir='${exec_prefix}/sbin'
sharedstatedir='${prefix}/com'
sysconfdir='${prefix}/etc'
target_alias=''

## ----------- ##
## confdefs.h. ##
## ----------- ##

#define ENABLE_NLS 1
#define GETTEXT_PACKAGE "gtk20"
#define GTK_COMPILED_WITH_DEBUGGING "minimum"
#define GTK_LOCALEDIR "/usr/local/share/locale"
#define HAVE_BIND_TEXTDOMAIN_CODESET 1
#define HAVE_BIND_TEXTDOMAIN_CODESET 1
#define HAVE_DCGETTEXT 1
#define HAVE_DLFCN_H 1
#define HAVE_FLOCKFILE 1
#define HAVE_GETPAGESIZE 1
#define HAVE_GETRESUID 1
#define HAVE_GETTEXT 1
#define HAVE_INTTYPES_H 1
#define HAVE_LC_MESSAGES 1
#define HAVE_LOCALE_H 1
#define HAVE_LSTAT 1
#define HAVE_MALLINFO 1
#define HAVE_MEMORY_H 1
#define HAVE_MKSTEMP 1
#define HAVE_MMAP 1
#define HAVE_PROGRESSIVE_JPEG 1
#define HAVE_PWD_H 1
#define HAVE_PWD_H 1
#define HAVE_SIGSETJMP 1
#define HAVE_STDINT_H 1
#define HAVE_STDLIB_H 1
#define HAVE_STDLIB_H 1
#define HAVE_STRINGS_H 1
#define HAVE_STRING_H 1
#define HAVE_SYS_STAT_H 1
#define HAVE_SYS_TIME_H 1
#define HAVE_SYS_TIME_H 1
#define HAVE_SYS_TYPES_H 1
#define HAVE_SYS_WAIT_H 1
#define HAVE_UNISTD_H 1
#define HAVE_UNISTD_H 1
#define HAVE_UNISTD_H 1
#define HAVE_UNISTD_H 1
#define HAVE_WCHAR_H 1
#define HAVE_WCTYPE_H 1
#define PACKAGE_BUGREPORT "http://bugzilla.gnome.org/enter_bug.cgi?product=gtk%2B"
#define PACKAGE_NAME "gtk+"
#define PACKAGE_STRING "gtk+ 2.6.8"
#define PACKAGE_TARNAME "gtk+"
#define PACKAGE_VERSION "2.6.8"
#define RETSIGTYPE void
#define RETSIGTYPE void
#define STDC_HEADERS 1
#define STDC_HEADERS 1
#define USE_GMODULE 1
#define USE_MMX 1
#define _FILE_OFFSET_BITS 64
#endif
#ifdef __cplusplus
extern "C" void std::exit (int) throw (); using std::exit;

configure: exit 1
This is really infuriating. Why the heck couldn't someone just make a GTK+ package for Debian???