Find the answer to your Linux question:
Results 1 to 2 of 2
I followed the instructions at http://www.linux-gamers.net/modules/...p?articleid=17 but when I try to compile wine, I get this error message: bitblt.c: In function `BITBLT_InternalStretchBlt': bitblt.c:1354: error: `Pixel' undeclared (first use in this ...
Enjoy an ad free experience by logging in. Not a member yet? Register.
  1. #1
    Just Joined!
    Join Date
    Oct 2004
    Location
    Finland
    Posts
    1

    Wine 20031212 Compilation error


    I followed the instructions at http://www.linux-gamers.net/modules/...p?articleid=17
    but when I try to compile wine, I get this error message:

    bitblt.c: In function `BITBLT_InternalStretchBlt':
    bitblt.c:1354: error: `Pixel' undeclared (first use in this function)
    bitblt.c:1354: error: (Each undeclared identifier is reported only once
    bitblt.c:1354: error: for each function it appears in.)
    bitblt.c:1354: error: parse error before "xor_pix"
    bitblt.c:1357: error: `xor_pix' undeclared (first use in this function)
    make[2]: *** [bitblt.o] Error 1
    make[2]: Leaving directory `/home/zyntax/downloads/wine-20031212/dlls/x11drv'
    make[1]: *** [x11drv] Error 2
    make[1]: Leaving directory `/home/zyntax/downloads/wine-20031212/dlls'
    make: *** [dlls] Error 2

    What may cause this?
    I'm using debian 2.6.8.1 sarge

  2. #2
    Just Joined!
    Join Date
    Jul 2005
    Location
    Wales Center, NY
    Posts
    4

    did this ever get resolved for you

    I have the same issue ...thought it might be an X11 library I didn't install, I am using frozen Sarge ver of Debian

Posting Permissions

  • You may not post new threads
  • You may not post replies
  • You may not post attachments
  • You may not edit your posts
  •