Find the answer to your Linux question:
Results 1 to 5 of 5
I can't seem to be able to emerge the nvidia kernel module when I emerge nvidia-glx because of a build error. Here is the complete output of my emerge: Code: ...
Enjoy an ad free experience by logging in. Not a member yet? Register.
  1. #1
    Just Joined!
    Join Date
    Jan 2005
    Posts
    28

    Cannot emerge nvidia-glx


    I can't seem to be able to emerge the nvidia kernel module when I emerge nvidia-glx because of a build error. Here is the complete output of my emerge:
    Code:
    root@wyatt wyatt # emerge nvidia-glx
    Calculating dependencies ...done!
    >>> emerge (1 of 2) media-video/nvidia-kernel-1.0.6629-r1 to /
    >>> md5 src_uri ;-) NVIDIA-Linux-x86-1.0-6629-pkg1.run
     * Determining the location of the kernel source code
     * Found kernel source directory:
     *     /usr/src/linux
     * Found sources for kernel version:
     *     2.6.11-gentoo-r3
     * Checking for MTRR support...                                           [ ok ]>>> Unpacking source...
    Creating directory NVIDIA-Linux-x86-1.0-6629-pkg1
    Verifying archive integrity... OK
    Uncompressing NVIDIA Accelerated Graphics Driver for Linux-x86 1.0-6629.........................................................................................................................................................................................................
     * Applying nv-shutup-warnings.patch ...                                  [ ok ] * Applying NVIDIA_kernel-1.0-6629-1155389.patch ...                      [ ok ] * Applying NVIDIA_kernel-1.0-6629-1162524.patch ...                      [ ok ] * Applying NVIDIA_kernel-1.0-6629-1165235.patch ...                      [ ok ] * Applying NVIDIA_kernel-1.0-6629-1171869.patch ...                      [ ok ] * Applying NVIDIA_kernel-1.0-6629-1175225.patch ...                      [ ok ] * Applying NVIDIA_kernel-1.0-6629-1182399.patch ...                      [ ok ] * Applying 2.6 kernel patches
     * Applying conftest_koutput_includes.patch ...                           [ ok ] * Applying nv-disable-preempt-on-smp_processor_id.patch ...              [ ok ] * Applying NVIDIA_kernel-1.0-6629-1161283.patch ...                      [ ok ] * Converting NVIDIA-Linux-x86-1.0-6629-pkg1/usr/src/nv/Makefile.kbuild to use M= instead of SUBDIRS=...                                                  [ ok ]>>> Source unpacked.
     * Preparing nvidia module
    
    NVIDIA: calling KBUILD...
    make CC=cc  KBUILD_VERBOSE=1 -C /usr/src/linux M=/var/tmp/portage/nvidia-kernel-1.0.6629-r1/work/NVIDIA-Linux-x86-1.0-6629-pkg1/usr/src/nv modules
    make[2]: warning: jobserver unavailable: using -j1.  Add `+' to parent make rule.
    mkdir -p /var/tmp/portage/nvidia-kernel-1.0.6629-r1/work/NVIDIA-Linux-x86-1.0-6629-pkg1/usr/src/nv/.tmp_versions
    make -f scripts/Makefile.build obj=/var/tmp/portage/nvidia-kernel-1.0.6629-r1/work/NVIDIA-Linux-x86-1.0-6629-pkg1/usr/src/nv
    echo \#define NV_COMPILER \"`cc -v 2>&1 | tail -n 1`\" > /var/tmp/portage/nvidia-kernel-1.0.6629-r1/work/NVIDIA-Linux-x86-1.0-6629-pkg1/usr/src/nv/nv_compiler.h  cc -Wp,-MD,/var/tmp/portage/nvidia-kernel-1.0.6629-r1/work/NVIDIA-Linux-x86-1.0-6629-pkg1/usr/src/nv/.nv.o.d -nostdinc -isystem /usr/lib/gcc-lib/i686-pc-linux-gnu/3.3.5/include -D__KERNEL__ -Iinclude  -Wall -Wstrict-prototypes -Wno-trigraphs -fno-strict-aliasing -fno-common -ffreestanding -O2     -fomit-frame-pointer -pipe -msoft-float -mpreferred-stack-boundary=2  -march=athlon -Iinclude/asm-i386/mach-default   -I/var/tmp/portage/nvidia-kernel-1.0.6629-r1/work/NVIDIA-Linux-x86-1.0-6629-pkg1/usr/src/nv -Wall -Wimplicit -Wreturn-type -Wswitch -Wformat -Wchar-subscripts -Wparentheses -Wno-multichar  -Werror -O -fno-common -MD   -Wno-cast-qual -Wno-error -D_LOOSE_KERNEL_NAMES -D__KERNEL__ -DMODULE  -DNTRM -D_GNU_SOURCE -D_LOOSE_KERNEL_NAMES -D__KERNEL__ -DMODULE  -DNV_MAJOR_VERSION=1 -DNV_MINOR_VERSION=0 -DNV_PATCHLEVEL=6629  -DNV_UNIX   -DNV_LINUX   -DNV_INT64_OK   -DNVCPU_X86      -UDEBUG -U_DEBUG -DNDEBUG -DNV_REMAP_PFN_RANGE_PRESENT -DNV_CHANGE_PAGE_ATTR_PRESENT -DNV_PCI_DISABLE_DEVICE_PRESENT -DNV_CLASS_SIMPLE_CREATE_PRESENT -DNV_PCI_GET_CLASS_PRESENT  -DMODULE -DKBUILD_BASENAME=nv -DKBUILD_MODNAME=nvidia -c -o /var/tmp/portage/nvidia-kernel-1.0.6629-r1/work/NVIDIA-Linux-x86-1.0-6629-pkg1/usr/src/nv/nv.o /var/tmp/portage/nvidia-kernel-1.0.6629-r1/work/NVIDIA-Linux-x86-1.0-6629-pkg1/usr/src/nv/nv.c
    /var/tmp/portage/nvidia-kernel-1.0.6629-r1/work/NVIDIA-Linux-x86-1.0-6629-pkg1/usr/src/nv/nv.c: In function `_get_phys_address':
    /var/tmp/portage/nvidia-kernel-1.0.6629-r1/work/NVIDIA-Linux-x86-1.0-6629-pkg1/usr/src/nv/nv.c:2529: warning: passing arg 1 of `pmd_offset' from incompatible pointer type
    /var/tmp/portage/nvidia-kernel-1.0.6629-r1/work/NVIDIA-Linux-x86-1.0-6629-pkg1/usr/src/nv/nv.c: In function `nv_agp_init':
    /var/tmp/portage/nvidia-kernel-1.0.6629-r1/work/NVIDIA-Linux-x86-1.0-6629-pkg1/usr/src/nv/nv.c:3010: warning: `inter_module_put' is deprecated (declared at include/linux/module.h:578)
      cc -Wp,-MD,/var/tmp/portage/nvidia-kernel-1.0.6629-r1/work/NVIDIA-Linux-x86-1.0-6629-pkg1/usr/src/nv/.nv-vm.o.d -nostdinc -isystem /usr/lib/gcc-lib/i686-pc-linux-gnu/3.3.5/include -D__KERNEL__ -Iinclude  -Wall -Wstrict-prototypes -Wno-trigraphs -fno-strict-aliasing -fno-common -ffreestanding -O2     -fomit-frame-pointer -pipe -msoft-float -mpreferred-stack-boundary=2  -march=athlon -Iinclude/asm-i386/mach-default   -I/var/tmp/portage/nvidia-kernel-1.0.6629-r1/work/NVIDIA-Linux-x86-1.0-6629-pkg1/usr/src/nv -Wall -Wimplicit -Wreturn-type -Wswitch -Wformat -Wchar-subscripts -Wparentheses -Wno-multichar  -Werror -O -fno-common -MD   -Wno-cast-qual -Wno-error -D_LOOSE_KERNEL_NAMES -D__KERNEL__ -DMODULE  -DNTRM -D_GNU_SOURCE -D_LOOSE_KERNEL_NAMES -D__KERNEL__ -DMODULE  -DNV_MAJOR_VERSION=1 -DNV_MINOR_VERSION=0 -DNV_PATCHLEVEL=6629  -DNV_UNIX   -DNV_LINUX   -DNV_INT64_OK  -DNVCPU_X86      -UDEBUG -U_DEBUG -DNDEBUG -DNV_REMAP_PFN_RANGE_PRESENT -DNV_CHANGE_PAGE_ATTR_PRESENT -DNV_PCI_DISABLE_DEVICE_PRESENT -DNV_CLASS_SIMPLE_CREATE_PRESENT -DNV_PCI_GET_CLASS_PRESENT  -DMODULE -DKBUILD_BASENAME=nv_vm -DKBUILD_MODNAME=nvidia -c -o /var/tmp/portage/nvidia-kernel-1.0.6629-r1/work/NVIDIA-Linux-x86-1.0-6629-pkg1/usr/src/nv/nv-vm.o /var/tmp/portage/nvidia-kernel-1.0.6629-r1/work/NVIDIA-Linux-x86-1.0-6629-pkg1/usr/src/nv/nv-vm.c
      cc -Wp,-MD,/var/tmp/portage/nvidia-kernel-1.0.6629-r1/work/NVIDIA-Linux-x86-1.0-6629-pkg1/usr/src/nv/.os-agp.o.d -nostdinc -isystem /usr/lib/gcc-lib/i686-pc-linux-gnu/3.3.5/include -D__KERNEL__ -Iinclude  -Wall -Wstrict-prototypes -Wno-trigraphs -fno-strict-aliasing -fno-common -ffreestanding -O2     -fomit-frame-pointer -pipe -msoft-float -mpreferred-stack-boundary=2  -march=athlon -Iinclude/asm-i386/mach-default   -I/var/tmp/portage/nvidia-kernel-1.0.6629-r1/work/NVIDIA-Linux-x86-1.0-6629-pkg1/usr/src/nv -Wall -Wimplicit -Wreturn-type -Wswitch -Wformat -Wchar-subscripts -Wparentheses -Wno-multichar  -Werror -O -fno-common -MD -Wno-cast-qual -Wno-error -D_LOOSE_KERNEL_NAMES -D__KERNEL__ -DMODULE  -DNTRM -D_GNU_SOURCE -D_LOOSE_KERNEL_NAMES -D__KERNEL__ -DMODULE  -DNV_MAJOR_VERSION=1 -DNV_MINOR_VERSION=0 -DNV_PATCHLEVEL=6629  -DNV_UNIX   -DNV_LINUX   -DNV_INT64_OK   -DNVCPU_X86      -UDEBUG -U_DEBUG -DNDEBUG -DNV_REMAP_PFN_RANGE_PRESENT -DNV_CHANGE_PAGE_ATTR_PRESENT -DNV_PCI_DISABLE_DEVICE_PRESENT -DNV_CLASS_SIMPLE_CREATE_PRESENT -DNV_PCI_GET_CLASS_PRESENT  -DMODULE -DKBUILD_BASENAME=os_agp -DKBUILD_MODNAME=nvidia -c -o /var/tmp/portage/nvidia-kernel-1.0.6629-r1/work/NVIDIA-Linux-x86-1.0-6629-pkg1/usr/src/nv/os-agp.o /var/tmp/portage/nvidia-kernel-1.0.6629-r1/work/NVIDIA-Linux-x86-1.0-6629-pkg1/usr/src/nv/os-agp.c
    /var/tmp/portage/nvidia-kernel-1.0.6629-r1/work/NVIDIA-Linux-x86-1.0-6629-pkg1/usr/src/nv/os-agp.c:48: error: parse error before '*' token
    /var/tmp/portage/nvidia-kernel-1.0.6629-r1/work/NVIDIA-Linux-x86-1.0-6629-pkg1/usr/src/nv/os-agp.c:48: warning: type defaults to `int' in declaration of `drm_agp_p'
    /var/tmp/portage/nvidia-kernel-1.0.6629-r1/work/NVIDIA-Linux-x86-1.0-6629-pkg1/usr/src/nv/os-agp.c:48: warning: data definition has no type or storage class
    /var/tmp/portage/nvidia-kernel-1.0.6629-r1/work/NVIDIA-Linux-x86-1.0-6629-pkg1/usr/src/nv/os-agp.c: In function `KernInitAGP':
    /var/tmp/portage/nvidia-kernel-1.0.6629-r1/work/NVIDIA-Linux-x86-1.0-6629-pkg1/usr/src/nv/os-agp.c:76: warning: assignment discards qualifiers from pointer target type
    /var/tmp/portage/nvidia-kernel-1.0.6629-r1/work/NVIDIA-Linux-x86-1.0-6629-pkg1/usr/src/nv/os-agp.c:85: error: request for member `acquire' in something not a structure or union
    /var/tmp/portage/nvidia-kernel-1.0.6629-r1/work/NVIDIA-Linux-x86-1.0-6629-pkg1/usr/src/nv/os-agp.c:88: warning: `inter_module_put' is deprecated (declared at include/linux/module.h:578)
    /var/tmp/portage/nvidia-kernel-1.0.6629-r1/work/NVIDIA-Linux-x86-1.0-6629-pkg1/usr/src/nv/os-agp.c:113: error: request for member `copy_info' in something not a structure or union
    /var/tmp/portage/nvidia-kernel-1.0.6629-r1/work/NVIDIA-Linux-x86-1.0-6629-pkg1/usr/src/nv/os-agp.c:173: error: request for member `enable' in something not a structure or union
    /var/tmp/portage/nvidia-kernel-1.0.6629-r1/work/NVIDIA-Linux-x86-1.0-6629-pkg1/usr/src/nv/os-agp.c:185: error: request for member `release' in something not a structure or union
    /var/tmp/portage/nvidia-kernel-1.0.6629-r1/work/NVIDIA-Linux-x86-1.0-6629-pkg1/usr/src/nv/os-agp.c:186: warning: `inter_module_put' is deprecated (declared at include/linux/module.h:578)
    /var/tmp/portage/nvidia-kernel-1.0.6629-r1/work/NVIDIA-Linux-x86-1.0-6629-pkg1/usr/src/nv/os-agp.c: In function `KernTeardownAGP':
    /var/tmp/portage/nvidia-kernel-1.0.6629-r1/work/NVIDIA-Linux-x86-1.0-6629-pkg1/usr/src/nv/os-agp.c:216: error: request for member `release' in something not a structure or union
    /var/tmp/portage/nvidia-kernel-1.0.6629-r1/work/NVIDIA-Linux-x86-1.0-6629-pkg1/usr/src/nv/os-agp.c:218: warning: `inter_module_put' is deprecated (declared at include/linux/module.h:578)
    /var/tmp/portage/nvidia-kernel-1.0.6629-r1/work/NVIDIA-Linux-x86-1.0-6629-pkg1/usr/src/nv/os-agp.c: In function `KernAllocAGPPages':
    /var/tmp/portage/nvidia-kernel-1.0.6629-r1/work/NVIDIA-Linux-x86-1.0-6629-pkg1/usr/src/nv/os-agp.c:265: error: request for member `allocate_memory' in something not a structure or union
    /var/tmp/portage/nvidia-kernel-1.0.6629-r1/work/NVIDIA-Linux-x86-1.0-6629-pkg1/usr/src/nv/os-agp.c:273: error: request for member `bind_memory' in something not a structure or union
    /var/tmp/portage/nvidia-kernel-1.0.6629-r1/work/NVIDIA-Linux-x86-1.0-6629-pkg1/usr/src/nv/os-agp.c:290: error: request for member `unbind_memory' in something not a structure or union
    /var/tmp/portage/nvidia-kernel-1.0.6629-r1/work/NVIDIA-Linux-x86-1.0-6629-pkg1/usr/src/nv/os-agp.c:305: error: request for member `free_memory' in something not a structure or union
    /var/tmp/portage/nvidia-kernel-1.0.6629-r1/work/NVIDIA-Linux-x86-1.0-6629-pkg1/usr/src/nv/os-agp.c: In function `KernMapAGPPages':
    /var/tmp/portage/nvidia-kernel-1.0.6629-r1/work/NVIDIA-Linux-x86-1.0-6629-pkg1/usr/src/nv/os-agp.c:345: error: request for member `unbind_memory' in something not a structure or union
    /var/tmp/portage/nvidia-kernel-1.0.6629-r1/work/NVIDIA-Linux-x86-1.0-6629-pkg1/usr/src/nv/os-agp.c: In function `KernFreeAGPPages':
    /var/tmp/portage/nvidia-kernel-1.0.6629-r1/work/NVIDIA-Linux-x86-1.0-6629-pkg1/usr/src/nv/os-agp.c:444: error: request for member `unbind_memory' in something not a structure or union
    /var/tmp/portage/nvidia-kernel-1.0.6629-r1/work/NVIDIA-Linux-x86-1.0-6629-pkg1/usr/src/nv/os-agp.c:445: error: request for member `free_memory' in something not a structure or union
    make[3]: *** [/var/tmp/portage/nvidia-kernel-1.0.6629-r1/work/NVIDIA-Linux-x86-1.0-6629-pkg1/usr/src/nv/os-agp.o] Error 1
    make[2]: *** [_module_/var/tmp/portage/nvidia-kernel-1.0.6629-r1/work/NVIDIA-Linux-x86-1.0-6629-pkg1/usr/src/nv] Error 2
    NVIDIA: left KBUILD.
    nvidia.ko failed to build!
    make[1]: *** [module] Error 1
    make: *** [module] Error 2
    
    !!! ERROR: media-video/nvidia-kernel-1.0.6629-r1 failed.
    !!! Function linux-mod_src_compile, Line 417, Exitcode 2
    !!! Unable to make                                  IGNORE_CC_MISMATCH=yes V=1 SYSSRC=/usr/src/linux SYSOUT=/usr/src/linux clean module.
    !!! If you need support, post the topmost build error, NOT this status message.
    If ANYONE has a suggestion, DON'T hesitate to post, PLEASE!

  2. #2
    Linux Guru lakerdonald's Avatar
    Join Date
    Jun 2004
    Location
    St. Petersburg, FL
    Posts
    5,035
    Sounds like a bug in the code. You might want to file a bug report/see if it's a known bug.
    If you google your error, you might get a patch or something.

  3. #3
    Linux Guru loft306's Avatar
    Join Date
    Oct 2003
    Location
    The DairyLand
    Posts
    1,666
    'emerge sync' and try again to see if they fixed it otherwise try either a newer version or and older version

    im running media-video/nvidia-kernel 1.0.7664 but that is the ~x86 version the unstable version
    also check gentoo bugzilla for like bugs http://bugs.gentoo.org/
    ~Mike ~~~ Forum Rules
    Testing? What's that? If it compiles, it is good, if it boots up, it is perfect. ~ Linus Torvalds
    http://loft306.org

  4. #4
    Linux Guru sarumont's Avatar
    Join Date
    Apr 2003
    Location
    /dev/urandom
    Posts
    3,682
    As loft said, that version is out of date. Put "media-video/nvidia-kernel ~x86" and "media-video/nvidia-glx ~x86" in /etc/portage/package.keywords.
    "Time is an illusion. Lunchtime, doubly so."
    ~Douglas Adams, The Hitchhiker's Guide to the Galaxy

  5. #5
    Linux Guru loft306's Avatar
    Join Date
    Oct 2003
    Location
    The DairyLand
    Posts
    1,666
    Quote Originally Posted by sarumont
    As loft said, that version is out of date. Put "media-video/nvidia-kernel ~x86" and "media-video/nvidia-glx ~x86" in /etc/portage/package.keywords.
    lolol
    OFFTOPIC: i was too tired to finnish the post.....
    ~Mike ~~~ Forum Rules
    Testing? What's that? If it compiles, it is good, if it boots up, it is perfect. ~ Linus Torvalds
    http://loft306.org

Posting Permissions

  • You may not post new threads
  • You may not post replies
  • You may not post attachments
  • You may not edit your posts
  •