Find the answer to your Linux question:
Results 1 to 2 of 2
I get this error now when i boot up my gentoo box and i now have no internet on it ,iproute2 does not require the function provided This has happend ...
Enjoy an ad free experience by logging in. Not a member yet? Register.
  1. #1
    Linux User mactabilis's Avatar
    Join Date
    Apr 2005
    Location
    moon
    Posts
    379

    ip


    I get this error now when i boot up my gentoo box and i now have no internet on it ,iproute2 does not require the function provided

    This has happend since i emerge --update --ask world ,It did not complete the update ,The pkg it could not update was the media /nvidia kernel but the kernel boots, now with this error and a string of other service errors i am offline ,And this is not my box i'm on,Any help would be good.It also said rename does not suply required function. And that no interface module has been loaded

  2. #2
    Linux User mactabilis's Avatar
    Join Date
    Apr 2005
    Location
    moon
    Posts
    379
    Ok thats done,I did dispatch-conf but now when i boot up it wont load nvidia module and when i emerge nvidia-kernel it gives me this error,


    Code:
    emerge --update --ask world
    
    These are the packages that I would merge, in order:
    
    Calculating world dependencies ...done!
    [ebuild     U ] media-video/nvidia-kernel-1.0.8178-r2 [1.0.6629-r4]
    ! er `nv_state' in something not a structure or union
    /var/tmp/portage/nvidia-kernel-1.0.8178-r2/work/NVIDIA-Linux-x86-1.0-8178-pkg1/usr/src/nv/nv.c: At top level:
    include/linux/elf.h:419: warning: array `_DYNAMIC' assumed to have one element
    include/linux/sched.h:318: error: storage size of `mmap_sem' isn't known
    include/linux/sched.h:364: error: storage size of `action' isn't known
    include/linux/sched.h:385: error: storage size of `shared_pending' isn't known
    include/linux/sched.h:448: error: storage size of `rlim' isn't known
    include/linux/sched.h:762: error: storage size of `start_time' isn't known
    include/linux/sched.h:791: error: storage size of `thread' isn't known
    include/linux/sched.h:803: error: storage size of `pending' isn't known
    include/linux/stat.h:68: error: storage size of `atime' isn't known
    include/linux/stat.h:69: error: storage size of `mtime' isn't known
    include/linux/stat.h:70: error: storage size of `ctime' isn't known
    include/linux/fs.h:288: error: storage size of `ia_atime' isn't known
    include/linux/fs.h:289: error: storage size of `ia_mtime' isn't known
    include/linux/fs.h:290: error: storage size of `ia_ctime' isn't known
    include/linux/quota.h:226: error: storage size of `dq_dqb' isn't known
    include/linux/fs.h:371: error: storage size of `bd_sem' isn't known
    include/linux/fs.h:372: error: storage size of `bd_mount_sem' isn't known
    include/linux/fs.h:447: error: storage size of `i_atime' isn't known
    include/linux/fs.h:448: error: storage size of `i_mtime' isn't known
    include/linux/fs.h:449: error: storage size of `i_ctime' isn't known
    include/linux/fs.h:456: error: storage size of `i_sem' isn't known
    include/linux/fs.h:457: error: storage size of `i_alloc_sem' isn't known
    include/linux/fs.h:604: error: storage size of `f_owner' isn't known
    include/linux/fs.h:792: error: storage size of `s_umount' isn't known
    include/linux/fs.h:793: error: storage size of `s_lock' isn't known
    include/linux/fs.h:822: error: storage size of `s_vfs_rename_sem' isn't known
    include/linux/device.h:224: error: storage size of `uevent_attr' isn't known
    /var/tmp/portage/nvidia-kernel-1.0.8178-r2/work/NVIDIA-Linux-x86-1.0-8178-pkg1/usr/src/nv/nv-linux.h:968: error: storage size of `tasklet' isn't known
    /var/tmp/portage/nvidia-kernel-1.0.8178-r2/work/NVIDIA-Linux-x86-1.0-8178-pkg1/usr/src/nv/nv-linux.h:979: error: storage size of `ldata_lock' isn't known
    /var/tmp/portage/nvidia-kernel-1.0.8178-r2/work/NVIDIA-Linux-x86-1.0-8178-pkg1/usr/src/nv/nv-linux.h:982: error: storage size of `at_lock' isn't known
    /var/tmp/portage/nvidia-kernel-1.0.8178-r2/work/NVIDIA-Linux-x86-1.0-8178-pkg1/usr/src/nv/nv.c:304: error: storage size of `nv_fops' isn't known
    /var/tmp/portage/nvidia-kernel-1.0.8178-r2/work/NVIDIA-Linux-x86-1.0-8178-pkg1/usr/src/nv/nv.c:205: warning: `nvos_proc_remove_all' declared `static' but never defined
    /var/tmp/portage/nvidia-kernel-1.0.8178-r2/work/NVIDIA-Linux-x86-1.0-8178-pkg1/usr/src/nv/nv.c:2636: warning: `nv_kern_read_cardinfo' defined but not used
    /var/tmp/portage/nvidia-kernel-1.0.8178-r2/work/NVIDIA-Linux-x86-1.0-8178-pkg1/usr/src/nv/nv.c:2756: warning: `nv_kern_read_status' defined but not used
    /var/tmp/portage/nvidia-kernel-1.0.8178-r2/work/NVIDIA-Linux-x86-1.0-8178-pkg1/usr/src/nv/nv.c:2839: warning: `nv_kern_read_registry' defined but not used
    /var/tmp/portage/nvidia-kernel-1.0.8178-r2/work/NVIDIA-Linux-x86-1.0-8178-pkg1/usr/src/nv/nv.c:2695: warning: `nv_kern_read_agpinfo' defined but not used
    /var/tmp/portage/nvidia-kernel-1.0.8178-r2/work/NVIDIA-Linux-x86-1.0-8178-pkg1/usr/src/nv/nv.c:2682: warning: `nv_kern_read_version' defined but not used
    /var/tmp/portage/nvidia-kernel-1.0.8178-r2/work/NVIDIA-Linux-x86-1.0-8178-pkg1/usr/src/nv/nv.c:2853: warning: `nv_kern_read_warning' defined but not used
    make[3]: *** [/var/tmp/portage/nvidia-kernel-1.0.8178-r2/work/NVIDIA-Linux-x86-1.0-8178-pkg1/usr/src/nv/nv.o] Error 1
    make[2]: *** [_module_/var/tmp/portage/nvidia-kernel-1.0.8178-r2/work/NVIDIA-Linux-x86-1.0-8178-pkg1/usr/src/nv] Error 2
    NVIDIA: left KBUILD.
    nvidia.ko failed to build!
    make[1]: *** [mdl] Error 1
    make: *** [module] Error 2
    
    !!! ERROR: media-video/nvidia-kernel-1.0.8178-r2 failed.
    !!! Function linux-mod_src_compile, Line 505, Exitcode 2
    !!! Unable to make                                  IGNORE_CC_MISMATCH=yes V=1 SYSSRC=/usr/src/linux SYSOUT=/usr/src/linux clean module.

Posting Permissions

  • You may not post new threads
  • You may not post replies
  • You may not post attachments
  • You may not edit your posts
  •