Find the answer to your Linux question:
Page 2 of 2 FirstFirst 1 2
Results 11 to 13 of 13
ConnDis.c:716: warning: function declaration isn't a prototype ConnDis.c:716: In function 'GetAuthorization': ConnDis.c:1176: warnning: implicit declaration of function 'XdmcpWrap' ConnDis.c:1176: warning: nested extern declaration of 'XdmcpWrap' make[3]: *** [ConnDis.lo] Error 1 ...
Enjoy an ad free experience by logging in. Not a member yet? Register.
  1. #11
    Linux Enthusiast crashandburn0420's Avatar
    Join Date
    Jun 2005
    Location
    Naugatuck, CT
    Posts
    590

    ConnDis.c:716: warning: function declaration isn't a prototype
    ConnDis.c:716: In function 'GetAuthorization':
    ConnDis.c:1176: warnning: implicit declaration of function 'XdmcpWrap'
    ConnDis.c:1176: warning: nested extern declaration of 'XdmcpWrap'
    make[3]: *** [ConnDis.lo] Error 1
    make[3]: Leaving directory '/var/tmp/portage/libX11-1.0.3/work/libX11-1.0.3/src'
    make[2]: *** [all-recursive] Error 1
    make[2]: Leaving directory '/var/tmp/portage/libX11-1.0.3/work/libX11-1.0.3/src'
    make[1]: *** [all] Error 2
    make[1]: Leaving directory '/var/tmp/portage/libX11-1.0.3/worklibX11-1.0.3/src'
    make: *** [all-recursive] Error 1

    !!! ERROR: X11-libs/libX11-1.0.3 failed
    Call stack:
    ebuild.sh, line 1539: Called dyn_compile
    ebuild.sh, line 939: Called src_compile
    ebuild.sh, line 1248: Called x-modular_src_compile
    x-modular.eclass, line 331: Called x-modular_src_make
    x-modular.eclass, line 326: Called die

    !!! emake failed
    !!! If you need support, post the topmost build error, and the call stack if relevant


    heres as much of the x11 libs error i can see

  2. #12
    Linux Enthusiast crashandburn0420's Avatar
    Join Date
    Jun 2005
    Location
    Naugatuck, CT
    Posts
    590
    BBBBUUUuuMmmP

  3. #13
    Linux Enthusiast crashandburn0420's Avatar
    Join Date
    Jun 2005
    Location
    Naugatuck, CT
    Posts
    590
    ok i got xorg libs installed right but now almost every other package is failing similar to that one

  4. $spacer_open
    $spacer_close
Page 2 of 2 FirstFirst 1 2

Posting Permissions

  • You may not post new threads
  • You may not post replies
  • You may not post attachments
  • You may not edit your posts
  •