Find the answer to your Linux question:
Page 3 of 3 FirstFirst 1 2 3
Results 21 to 27 of 27
I've tried also to check if I have all the packages indicated by the README file and I've found that I haven't only: libswig1.3.22 I've searched for it on debian.org ...
Enjoy an ad free experience by logging in. Not a member yet? Register.
  1. #21
    Just Joined!
    Join Date
    Aug 2010
    Posts
    23

    I've tried also to check if I have all the packages indicated by the README file and I've found that I haven't only:
    libswig1.3.22
    I've searched for it on debian.org but I don't find nothing that contains in its name "libswig"
    and also with the package manager the result is the same...

  2. #22
    Just Joined!
    Join Date
    Aug 2010
    Posts
    23
    one my friend has noticed that in the make appears that it search in python2.3 when I've got python2.6...
    so he has said to me to do:
    Code:
    sudo ln -s /usr/include/python2.6 /usr/include/python2.3
    and now the error is changed in
    Code:
    gabriele@Paolo:~/work/mcc/libhid-0.2.12.orig$ make
    make  all-recursive
    make[1]: ingresso nella directory «/home/gabriele/work/mcc/libhid-0.2.12.orig»
    Making all in hidparser
    make[2]: ingresso nella directory «/home/gabriele/work/mcc/libhid-0.2.12.orig/hidparser»
    make[2]: Non c'č da fare nulla per «all»
    make[2]: uscita dalla directory «/home/gabriele/work/mcc/libhid-0.2.12.orig/hidparser»
    Making all in src
    make[2]: ingresso nella directory «/home/gabriele/work/mcc/libhid-0.2.12.orig/src»
    make[2]: uscita dalla directory «/home/gabriele/work/mcc/libhid-0.2.12.orig/src»
    Making all in swig
    make[2]: ingresso nella directory «/home/gabriele/work/mcc/libhid-0.2.12.orig/swig»
    make[3]: ingresso nella directory «/home/gabriele/work/mcc/libhid-0.2.12.orig/src»
    make[3]: uscita dalla directory «/home/gabriele/work/mcc/libhid-0.2.12.orig/src»
    make[2]: uscita dalla directory «/home/gabriele/work/mcc/libhid-0.2.12.orig/swig»
    Making all in test
    make[2]: ingresso nella directory «/home/gabriele/work/mcc/libhid-0.2.12.orig/test»
    make[3]: ingresso nella directory «/home/gabriele/work/mcc/libhid-0.2.12.orig/src»
    make[3]: uscita dalla directory «/home/gabriele/work/mcc/libhid-0.2.12.orig/src»
    make[2]: uscita dalla directory «/home/gabriele/work/mcc/libhid-0.2.12.orig/test»
    Making all in doc
    make[2]: ingresso nella directory «/home/gabriele/work/mcc/libhid-0.2.12.orig/doc»
    Making all in www
    make[3]: ingresso nella directory «/home/gabriele/work/mcc/libhid-0.2.12.orig/doc/www»
    make[3]: Non c'č da fare nulla per «all»
    make[3]: uscita dalla directory «/home/gabriele/work/mcc/libhid-0.2.12.orig/doc/www»
    Making all in man
    make[3]: ingresso nella directory «/home/gabriele/work/mcc/libhid-0.2.12.orig/doc/man»
    make[3]: Non c'č da fare nulla per «all»
    make[3]: uscita dalla directory «/home/gabriele/work/mcc/libhid-0.2.12.orig/doc/man»
    make[3]: ingresso nella directory «/home/gabriele/work/mcc/libhid-0.2.12.orig/doc»
    chmod -R a+rX html
    find html -type d -exec chmod 711 {} \;
    make[3]: uscita dalla directory «/home/gabriele/work/mcc/libhid-0.2.12.orig/doc»
    make[2]: uscita dalla directory «/home/gabriele/work/mcc/libhid-0.2.12.orig/doc»
    make[2]: ingresso nella directory «/home/gabriele/work/mcc/libhid-0.2.12.orig»
    make[2]: *** Nessuna regola per creare l'obiettivo «debian/changelog», necessario a «all-am».  Arresto.
    make[2]: uscita dalla directory «/home/gabriele/work/mcc/libhid-0.2.12.orig»
    make[1]: *** [all-recursive] Errore 1
    make[1]: uscita dalla directory «/home/gabriele/work/mcc/libhid-0.2.12.orig»
    make: *** [all] Errore 2

  3. #23
    Linux Engineer Segfault's Avatar
    Join Date
    Jun 2008
    Location
    Acadiana
    Posts
    877
    Nessuna regola per creare l'obiettivo «debian/changelog», necessario a «all-am». Arresto.

    What's that?

  4. #24
    Just Joined!
    Join Date
    Aug 2010
    Posts
    23
    translated sounds like:
    No rule to make target ' debian / changelog ' need to ' all- am '. Arrest.

  5. #25
    Linux Engineer Segfault's Avatar
    Join Date
    Jun 2008
    Location
    Acadiana
    Posts
    877
    I'd exclude debian/changelog, doesn't sound like it is something essential.

  6. #26
    Just Joined!
    Join Date
    Aug 2010
    Posts
    23
    Code:
    gabriele @ Paul: ~ / $ make work/mcc/libhid-0.2.12.orig
    make all-recursive
    make [1]: entering directory '/ home/gabriele/work/mcc/libhid-0.2.12.orig "
    Making all in hidparser
    make [2]: entering directory '/ home/gabriele/work/mcc/libhid-0.2.12.orig/hidparser "
    make [2]: There is nothing to be done for `all '
    make [2]: leaving directory '/ home/gabriele/work/mcc/libhid-0.2.12.orig/hidparser "
    Making all in src
    make [2]: entering directory '/ home/gabriele/work/mcc/libhid-0.2.12.orig/src "
    make [2]: leaving directory '/ home/gabriele/work/mcc/libhid-0.2.12.orig/src "
    Making all in swig
    make [2]: entering directory '/ home/gabriele/work/mcc/libhid-0.2.12.orig/swig "
    if / bin / bash .. / libtool - tag = CC - mode = compile gcc-DHAVE_CONFIG_H-I. -I. -I .. -I/usr/include/python2.3 / -I../include -I../include-DHID_INTERNAL-DSWIG -I../hidparser-DNDEBUG-fPIC-fno-strict-aliasing -I/usr/local / include-O2-Wall-W-MT hid_wrap.lo-MD-MP-MF ".deps / hid_wrap.Tpo"-c-o hid_wrap.lo hid_wrap.c; \
            then mv-f ".deps / hid_wrap.Tpo" ".deps / hid_wrap.Plo" else rm-f ".deps / hid_wrap.Tpo" exit 1 fi
     gcc-DHAVE_CONFIG_H-I. -I. -I .. -I/usr/include/python2.3 / -I../include -I../include-DHID_INTERNAL-DSWIG -I../hidparser-DNDEBUG-fPIC-fno-strict-aliasing -I/usr/local / include-O2-Wall-W-MT hid_wrap.lo-MD-MP-MF .deps / hid_wrap.Tpo hid_wrap.c-c-fPIC-DPIC-o .libs / hid_wrap.o
    hid_wrap.c: In function 'SWIG_PyInstanceMethod_New':
    hid_wrap.c: 1050: warning: unused parameter 'func'
    hid_wrap.c: In function '_PySwigObject_type':
    hid_wrap.c: 1823: warning: missing initializer
    hid_wrap.c: 1823: warning: (near initialization for 'tmp.tp_version_tag')
    hid_wrap.c: In function '_PySwigPacked_type':
    hid_wrap.c: 1998: warning: missing initializer
    hid_wrap.c: 1998: warning: (near initialization for 'tmp.tp_version_tag')
    hid_wrap.c: In function 'SWIG_Python_ConvertPtrAndOwn':
    hid_wrap.c: 2158: warning: implicit declaration of function 'assert'
    hid_wrap.c: In function 'SWIG_Python_MustGetPtr':
    hid_wrap.c: 2630: warning: unused parameter 'argnum'
    hid_wrap.c: In function 'swig_varlink_type':
    hid_wrap.c: 4791: warning: missing initializer
    hid_wrap.c: 4791: warning: (near initialization for 'tmp.tp_version_tag')
     gcc-DHAVE_CONFIG_H-I. -I. -I .. -I/usr/include/python2.3 / -I../include -I../include-DHID_INTERNAL-DSWIG -I../hidparser-DNDEBUG-fPIC-fno-strict-aliasing -I/usr/local / include-O2-Wall-W-MT hid_wrap.lo-MD-MP-MF .deps / hid_wrap.Tpo-c-o hid_wrap.c hid_wrap.o> / dev / null 2> & 1
    make [3]: entering directory '/ home/gabriele/work/mcc/libhid-0.2.12.orig/src "
    make [3]: leaving directory '/ home/gabriele/work/mcc/libhid-0.2.12.orig/src "
    / Bin / bash .. / libtool - tag = CC - mode = link gcc-fPIC-fno-strict-aliasing -I/usr/local/include-O2-Wall-W-shared .. / src / libhid. -L/usr/local/lib-the-lusb lusb _hid.la-or-rpath / usr/local/lib/python2.6/site-packages/hid-module hid_wrap.lo
    gcc-shared .libs / hid_wrap.o-Wl, - rpath-Wl, / home/gabriele/work/mcc/libhid-0.2.12.orig/src/.libs-Wl, - rpath-Wl, / usr / local / lib-Wl, - rpath-Wl, / usr / local / lib .. / src / .libs / libhid.so -L/usr/local/lib / usr / local / lib /-Wl libusb.so ,-soname-Wl,-or _hid.so.0 .libs/_hid.so.0.0.0
    (Cd. Libs & & rm-f _hid.so.0 & & ln-s _hid.so.0.0.0 _hid.so.0)
    (Cd. Libs & & rm-f _hid.so & & ln-s _hid.so.0.0.0 _hid.so)
    ar cru .libs / _hid.a hid_wrap.o
    ranlib .libs / _hid.a
    creating _hid.la
    (Cd. Libs & & rm-f _hid.la & & ln-s .. / _hid.la _hid.la)
    make [2]: leaving directory '/ home/gabriele/work/mcc/libhid-0.2.12.orig/swig "
    Making all in tests
    make [2]: entering directory '/ home/gabriele/work/mcc/libhid-0.2.12.orig/test "
    if gcc-DHAVE_CONFIG_H-I. -I. -I .. -I../hidparser -I../include -I/usr/local/include-DNDEBUG-O2-Wall-W-Werror-MT test_libhid.o-MD-MP-MF ".deps / test_libhid.Tpo - c-o test_libhid.o test_libhid.c; \
            then mv-f ".deps / test_libhid.Tpo" ".deps / test_libhid.Po" else rm-f ".deps / test_libhid.Tpo" exit 1 fi
    make [3]: entering directory '/ home/gabriele/work/mcc/libhid-0.2.12.orig/src "
    make [3]: leaving directory '/ home/gabriele/work/mcc/libhid-0.2.12.orig/src "
    / Bin / bash .. / libtool - tag = CC - mode = link gcc-O2 -I/usr/local/include-Wall-W-Werror-lusb -L/usr/local/lib-o test_libhid test_libhid. or .. / src / libhid.la
    mkdir. libs
    gcc -I/usr/local/include-O2-Wall-W-Werror-o .libs / test_libhid test_libhid.o -L/usr/local/lib / usr / local / lib / libusb.so .. / src /. libs / libhid.so-Wl, - rpath-Wl, / usr / local / lib
    creating test_libhid
    if gcc-DHAVE_CONFIG_H-I. -I. -I .. -I../hidparser -I../include -I/usr/local/include-DNDEBUG-O2-Wall-W-Werror-MT lshid.o-MD-MP-MF ".deps / lshid.Tpo - c-o lshid.o lshid.c; \
            then mv-f ".deps / lshid.Tpo" ".deps / lshid.Po" else rm-f ".deps / lshid.Tpo" exit 1 fi
    / Bin / bash .. / libtool - tag = CC - mode = link gcc-O2 -I/usr/local/include-Wall-W-Werror-lusb -L/usr/local/lib-o lshid lshid. or .. / src / libhid.la
    gcc -I/usr/local/include-O2-Wall-W-Werror-o .libs / lshid lshid.o -L/usr/local/lib / usr / local / lib / libusb.so .. / src /. libs / libhid.so-Wl, - rpath-Wl, / usr / local / lib
    creating lshid
    Make [2]: leaving directory '/ home/gabriele/work/mcc/libhid-0.2.12.orig/test "
    Making all in doc
    make [2]: entering directory '/ home/gabriele/work/mcc/libhid-0.2.12.orig/doc "
    Making all in www
    make [3]: entering directory '/ home/gabriele/work/mcc/libhid-0.2.12.orig/doc/www "
    make [3]: There is nothing to be done for `all '
    make [3]: leaving directory '/ home/gabriele/work/mcc/libhid-0.2.12.orig/doc/www "
    Making all in man
    make [3]: entering directory '/ home/gabriele/work/mcc/libhid-0.2.12.orig/doc/man "
    make [3]: There is nothing to be done for `all '
    make [3]: leaving directory '/ home/gabriele/work/mcc/libhid-0.2.12.orig/doc/man "
    make [3]: entering directory '/ home/gabriele/work/mcc/libhid-0.2.12.orig/doc "
    doxygen doxygen.rc
    Warning: Tag `USE_WINDOWS_ENCODING 'at line 45 of file doxygen.rc has Become Obsolete.
    To Avoid this warning please update your configuration file using "doxygen-u"
    Warning: Tag `DETAILS_AT_TOP 'at line 127 of file doxygen.rc has Become Obsolete.
    To Avoid this warning please update your configuration file using "doxygen-u"
    Warning: Tag `MAX_DOT_GRAPH_WIDTH 'at line 1068 of file doxygen.rc has Become Obsolete.
    To Avoid this warning please update your configuration file using "doxygen-u"
    Warning: Tag `MAX_DOT_GRAPH_HEIGHT 'at line 1076 of file doxygen.rc has Become Obsolete.
    To Avoid this warning please update your configuration file using "doxygen-u"
    / Home/gabriele/work/mcc/libhid-0.2.12.orig/doc/frontpage.dox: 204: Warning: May not use HTML tags the 'empty tag' XHTML syntax.
    / Home/gabriele/work/mcc/libhid-0.2.12.orig/doc/frontpage.dox: 208: Warning: Unexpected html tags found <img> Within <a href=...> context
    chmod-R a + rX html
    find html-type d-exec chmod 711 () \;
    make [3]: leaving directory '/ home/gabriele/work/mcc/libhid-0.2.12.orig/doc "
    make [2]: leaving directory '/ home/gabriele/work/mcc/libhid-0.2.12.orig/doc "
    make [2]: entering directory '/ home/gabriele/work/mcc/libhid-0.2.12.orig "
    make [2]: *** No rule to make target 'debian / changelog' need to 'all-am'. Arrest.
    make [2]: leaving directory '/ home/gabriele/work/mcc/libhid-0.2.12.orig "
    make [1]: *** [all-recursive] Error 1
    make [1]: leaving directory '/ home/gabriele/work/mcc/libhid-0.2.12.orig "
    make: *** [all] Error 2
    this is the error message translated by google.
    now it may be more comprehensible.

  7. #27
    Just Joined!
    Join Date
    Aug 2010
    Posts
    23

    Thumbs up solved

    finally it is solved: my professor has given me faulty drivers. now they run.
    thank you very much for the help.

Page 3 of 3 FirstFirst 1 2 3

Posting Permissions

  • You may not post new threads
  • You may not post replies
  • You may not post attachments
  • You may not edit your posts
  •