hi,
the ./configre process was successfully done,but with $make this is the errors:
/usr/include/stdlib.h:815: error: parse error before "size_t"
/usr/include/stdlib.h:819: error: parse error before "size_t"
/usr/include/stdlib.h:822: error: parse error before "size_t"
/usr/include/stdlib.h:830: error: parse error before "size_t"
/usr/include/stdlib.h:834: error: parse error before "size_t"
/usr/include/stdlib.h:841: error: parse error before "mbstowcs"
/usr/include/stdlib.h:842: error: parse error before "size_t"
/usr/include/stdlib.h:844: error: parse error before "wcstombs"
/usr/include/stdlib.h:845: error: parse error before "size_t"
In file included from wallp.h:14,
from gtk_listi.c:25:
/usr/include/dirent.h:311: error: parse error before "size_t"
In file included from /usr/X11R6/include/X11/Xos.h:154,
from wallp.h:19,
from gtk_listi.c:25:
/usr/include/unistd.h:312: error: parse error before "size_t"
/usr/include/unistd.h:318: error: parse error before "size_t"
/usr/include/unistd.h:448: error: parse error before "size_t"
In file included from /usr/X11R6/include/X11/Xos.h:154,
from wallp.h:19,
from gtk_listi.c:25:
/usr/include/unistd.h:538: error: parse error before "confstr"
/usr/include/unistd.h:538: error: parse error before "size_t"
/usr/include/unistd.h:707: error: parse error before "size_t"
/usr/include/unistd.h:732: error: parse error before "size_t"
In file included from /usr/X11R6/include/X11/Xos.h:154,
from wallp.h:19,
from gtk_listi.c:25:
/usr/include/unistd.h:783: error: parse error before "size_t"
/usr/include/unistd.h:790: error: parse error before "size_t"
/usr/include/unistd.h:800: error: parse error before "size_t"
/usr/include/unistd.h:801: error: parse error before "size_t"
/usr/include/unistd.h:818: error: parse error before "size_t"
/usr/include/gconv.h:176: warning: array `__data' assumed to have one element
make[2]: *** [gtk_listi.o] Error 1
make[2]: Leaving directory `/ins/wallp-0.64/src'
make[1]: *** [all-recursive] Error 1
make[1]: Leaving directory `/ins/wallp-0.64'
make: *** [all-recursive-am] Error 2
plz help me.