hi,
i want to install wallp-0.64,the configure process is successfull while with make these are the errors:

Type make to build WallP for your system.

[root@localhost wallp-0.64]# make
make all-recursive
make[1]: Entering directory `/ins/wallp-0.64'
Making all in src
make[2]: Entering directory `/ins/wallp-0.64/src'
gcc -DHAVE_CONFIG_H -I. -I. -I.. -I/usr/include/gtk-1.2 -I/usr/include/glib-1.2 -I/usr/lib/glib/include -I/usr/X11R6/include -I/usr/X11R6/include -g -O2 -c gtk_listi.c
gtk_listi.c:18:25: missing terminating " character
gtk_listi.c:19: error: parse error before "$"
gtk_listi.c:19:26: missing terminating " character
In file included from /usr/include/_G_config.h:44,
from /usr/include/libio.h:32,
from /usr/include/stdio.h:72,
from gtk_listi.c:20:
/usr/include/gconv.h:72: error: parse error before "size_t"
/usr/include/gconv.h:88: error: parse error before "size_t"
/usr/include/gconv.h:97: error: parse error before "size_t"
/usr/include/gconv.h:174: error: parse error before "size_t"
/usr/include/gconv.h:177: error: parse error before '}' token
In file included from /usr/include/libio.h:32,
from /usr/include/stdio.h:72,
from gtk_listi.c:20:
/usr/include/_G_config.h:47: error: field `__cd' has incomplete type
/usr/include/_G_config.h:50: error: field `__cd' has incomplete type
In file included from /usr/include/stdio.h:72,
from gtk_listi.c:20:
/usr/include/libio.h:351: error: parse error before "size_t"
/usr/include/libio.h:360: error: parse error before "size_t"
/usr/include/libio.h:468: error: parse error before "_IO_sgetn"
/usr/include/libio.h:468: error: parse error before "size_t"
In file included from gtk_listi.c:20:
/usr/include/stdio.h:302: error: parse error before "size_t"
/usr/include/stdio.h:309: error: parse error before "size_t"
/usr/include/stdio.h:351: error: parse error before "size_t"
/usr/include/stdio.h:355: error: parse error before "size_t"
/usr/include/stdio.h:603: error: parse error before "fread"
/usr/include/stdio.h:603: error: parse error before "size_t"
/usr/include/stdio.h:609: error: parse error before "fwrite"
/usr/include/stdio.h:609: error: parse error before "size_t"
/usr/include/stdio.h:631: error: parse error before "fread_unlocked"
/usr/include/stdio.h:631: error: parse error before "size_t"
/usr/include/stdio.h:633: error: parse error before "fwrite_unlocked"
/usr/include/stdio.h:633: error: parse error before "size_t"
In file included from gtk_listi.c:21:
/usr/include/string.h:39: error: parse error before "size_t"
/usr/include/string.h:42: error: parse error before "size_t"
/usr/include/string.h:51: error: parse error before "size_t"
/usr/include/string.h:58: error: parse error before "size_t"
/usr/include/string.h:61: error: parse error before "size_t"
/usr/include/string.h:65: error: parse error before "size_t"
/usr/include/string.h:86: error: parse error before "size_t"
/usr/include/string.h:93: error: parse error before "size_t"
/usr/include/string.h:99: error: parse error before "size_t"
/usr/include/string.h:106: error: parse error before "strxfrm"
/usr/include/string.h:107: error: parse error before "size_t"
/usr/include/string.h:176: error: parse error before "strcspn"
/usr/include/string.h:180: error: parse error before "strspn"
/usr/include/string.h:230: error: parse error before "strlen"
/usr/include/string.h:248: error: parse error before "size_t"
/usr/include/string.h:253: error: parse error before "size_t"
/usr/include/string.h:257: error: parse error before "size_t"
/usr/include/string.h:260: error: parse error before "size_t"
/usr/include/string.h:263: error: parse error before "size_t"
/usr/include/string.h:291: error: parse error before "size_t"
In file included from /usr/include/string.h:375,
from gtk_listi.c:21:
/usr/include/bits/string2.h:919: error: parse error before "__strcspn_c1"
/usr/include/bits/string2.h:921: error: parse error before "__strcspn_c1"
/usr/include/bits/string2.h: In function `__strcspn_c1':
/usr/include/bits/string2.h:923: error: syntax error before "__result"
/usr/include/bits/string2.h:924: error: `__result' undeclared (first use in this function)
/usr/include/bits/string2.h:924: error: (Each undeclared identifier is reported only once
/usr/include/bits/string2.h:924: error: for each function it appears in.)
/usr/include/bits/string2.h: At top level:
/usr/include/bits/string2.h:929: error: parse error before "__strcspn_c2"
/usr/include/bits/string2.h:932: error: parse error before "__strcspn_c2"
/usr/include/bits/string2.h: In function `__strcspn_c2':
/usr/include/bits/string2.h:934: error: syntax error before "__result"
/usr/include/bits/string2.h:935: error: `__result' undeclared (first use in this function)
/usr/include/bits/string2.h: At top level:
/usr/include/bits/string2.h:941: error: parse error before "__strcspn_c3"
/usr/include/bits/string2.h:944: error: parse error before "__strcspn_c3"
/usr/include/bits/string2.h: In function `__strcspn_c3':
/usr/include/bits/string2.h:947: error: syntax error before "__result"
/usr/include/bits/string2.h:948: error: `__result' undeclared (first use in this function)
/usr/include/bits/string2.h: At top level:
/usr/include/bits/string2.h:976: error: parse error before "__strspn_c1"
/usr/include/bits/string2.h:978: error: parse error before "__strspn_c1"
/usr/include/bits/string2.h: In function `__strspn_c1':
/usr/include/bits/string2.h:980: error: syntax error before "__result"
/usr/include/bits/string2.h:982: error: `__result' undeclared (first use in this function)
/usr/include/bits/string2.h: At top level:
/usr/include/bits/string2.h:987: error: parse error before "__strspn_c2"
/usr/include/bits/string2.h:990: error: parse error before "__strspn_c2"
/usr/include/bits/string2.h: In function `__strspn_c2':
/usr/include/bits/string2.h:992: error: syntax error before "__result"
/usr/include/bits/string2.h:994: error: `__result' undeclared (first use in this function)
/usr/include/bits/string2.h: At top level:
/usr/include/bits/string2.h:999: error: parse error before "__strspn_c3"
/usr/include/bits/string2.h:1002: error: parse error before "__strspn_c3"
/usr/include/bits/string2.h: In function `__strspn_c3':
/usr/include/bits/string2.h:1004: error: syntax error before "__result"
/usr/include/bits/string2.h:1006: error: `__result' undeclared (first use in this function)
/usr/include/bits/string2.h: In function `__strpbrk_c2':
/usr/include/bits/string2.h:1041: error: `size_t' undeclared (first use in this function)
/usr/include/bits/string2.h:1041: error: parse error before "__s"
/usr/include/bits/string2.h: In function `__strpbrk_c3':
/usr/include/bits/string2.h:1054: error: `size_t' undeclared (first use in this function)
/usr/include/bits/string2.h:1054: error: parse error before "__s"
In file included from /usr/include/bits/string2.h:1211,
from /usr/include/string.h:375,
from gtk_listi.c:21:
/usr/include/stdlib.h: At top level:
/usr/include/stdlib.h:556: error: parse error before "__size"
/usr/include/stdlib.h:558: error: parse error before "__nmemb"
In file included from /usr/include/string.h:375,
from gtk_listi.c:21:
/usr/include/bits/string2.h:1235: error: parse error before "size_t"
In file included from gtk_listi.c:22:
/usr/include/time.h:197: error: parse error before "strftime"
/usr/include/time.h:197: error: parse error before "size_t"
In file included from wallp.h:12,
from gtk_listi.c:25:
/usr/include/stdlib.h:137: error: parse error before "__ctype_get_mb_cur_max"
In file included from /usr/include/sys/types.h:266,
from /usr/include/stdlib.h:416,
from wallp.h:12,
from gtk_listi.c:25:
/usr/include/bits/pthreadtypes.h:48: error: parse error before "size_t"
/usr/include/bits/pthreadtypes.h:51: error: parse error before "__stacksize"
In file included from wallp.h:12,
from gtk_listi.c:25:
/usr/include/stdlib.h:433: error: parse error before "size_t"
/usr/include/stdlib.h:462: error: parse error before "size_t"
/usr/include/stdlib.h:567: error: parse error before "size_t"
In file included from /usr/include/stdlib.h:578,
from wallp.h:12,
from gtk_listi.c:25:
/usr/include/alloca.h:33: error: parse error before "__size"
In file included from wallp.h:12,
from gtk_listi.c:25:
/usr/include/stdlib.h:583: error: parse error before "__size"
/usr/include/stdlib.h:739: error: parse error before "size_t"
/usr/include/stdlib.h:743: error: parse error before "size_t"
/usr/include/stdlib.h:812: error: parse error before "size_t"
/usr/include/stdlib.h:815: error: parse error before "size_t"
/usr/include/stdlib.h:819: error: parse error before "size_t"
/usr/include/stdlib.h:822: error: parse error before "size_t"
/usr/include/stdlib.h:830: error: parse error before "size_t"
/usr/include/stdlib.h:834: error: parse error before "size_t"
/usr/include/stdlib.h:841: error: parse error before "mbstowcs"
/usr/include/stdlib.h:842: error: parse error before "size_t"
/usr/include/stdlib.h:844: error: parse error before "wcstombs"
/usr/include/stdlib.h:845: error: parse error before "size_t"
In file included from wallp.h:14,
from gtk_listi.c:25:
/usr/include/dirent.h:311: error: parse error before "size_t"
In file included from /usr/X11R6/include/X11/Xos.h:154,
from wallp.h:19,
from gtk_listi.c:25:
/usr/include/unistd.h:312: error: parse error before "size_t"
/usr/include/unistd.h:318: error: parse error before "size_t"
/usr/include/unistd.h:448: error: parse error before "size_t"
In file included from /usr/X11R6/include/X11/Xos.h:154,
from wallp.h:19,
from gtk_listi.c:25:
/usr/include/unistd.h:538: error: parse error before "confstr"
/usr/include/unistd.h:538: error: parse error before "size_t"
/usr/include/unistd.h:707: error: parse error before "size_t"
/usr/include/unistd.h:732: error: parse error before "size_t"
In file included from /usr/X11R6/include/X11/Xos.h:154,
from wallp.h:19,
from gtk_listi.c:25:
/usr/include/unistd.h:783: error: parse error before "size_t"
/usr/include/unistd.h:790: error: parse error before "size_t"
/usr/include/unistd.h:800: error: parse error before "size_t"
/usr/include/unistd.h:801: error: parse error before "size_t"
/usr/include/unistd.h:818: error: parse error before "size_t"
/usr/include/gconv.h:176: warning: array `__data' assumed to have one element
make[2]: *** [gtk_listi.o] Error 1
make[2]: Leaving directory `/ins/wallp-0.64/src'
make[1]: *** [all-recursive] Error 1
make[1]: Leaving directory `/ins/wallp-0.64'
make: *** [all-recursive-am] Error 2
plz help me.