hi,
I compiled kernel-2.6.5 for mandrake 10 after booting with this onethere
was error" fs type supermount not supported by kernel",i applyed the
patch-2.5.4-ck2.bz2 to add the support for supermount to the kernel.
i again configured the kernel but when started make bzImage these are errors
wich was not bofore applying patch to the kernel:
CC arch/i386/mm/pageattr.o
LD arch/i386/mm/built-in.o
CC arch/i386/mach-default/setup.o
CC arch/i386/mach-default/topology.o
LD arch/i386/mach-default/built-in.o
CC kernel/sched.o
kernel/sched.c: In function `dequeue_task':
kernel/sched.c:195: error: structure has no member named `array'
kernel/sched.c: In function `enqueue_task':
kernel/sched.c:204: error: structure has no member named `array'
kernel/sched.c: In function `try_to_wake_up':
kernel/sched.c:565: error: structure has no member named `activated'
kernel/sched.c: In function `scheduler_tick':
kernel/sched.c:1226: warning: implicit declaration of function `wake_priority_sl
eeper'
kernel/sched.c:1228: warning: passing arg 1 of `rebalance_tick' makes pointer fr
om integer without a cast
kernel/sched.c:1228: warning: passing arg 2 of `rebalance_tick' makes integer fr
om pointer without a cast
kernel/sched.c:1228: error: too many arguments to function `rebalance_tick'
kernel/sched.c:1238: error: structure has no member named `array'
kernel/sched.c:1281: warning: passing arg 1 of `rebalance_tick' makes pointer fr
om integer without a cast
kernel/sched.c:1281: warning: passing arg 2 of `rebalance_tick' makes integer fr
om pointer without a cast
kernel/sched.c:1281: error: too many arguments to function `rebalance_tick'
kernel/sched.c: In function `schedule':
kernel/sched.c:1451: error: structure has no member named `activated'
kernel/sched.c:1454: error: structure has no member named `activated'
kernel/sched.c:1455: error: `ON_RUNQUEUE_WEIGHT' undeclared (first use in this f unction)
kernel/sched.c:1455: error: (Each undeclared identifier is reported only once
kernel/sched.c:1455: error: for each function it appears in.)
kernel/sched.c:1458: warning: passing arg 2 of `dequeue_task' from incompatible pointer type
kernel/sched.c:1459: warning: implicit declaration of function `recalc_task_prio '
kernel/sched.c:1460: warning: passing arg 2 of `enqueue_task' from incompatible pointer type
kernel/sched.c:1462: error: structure has no member named `activated'
kernel/sched.c:1468: error: structure has no member named `sleep_avg'
kernel/sched.c:1469: error: structure has no member named `sleep_avg'
kernel/sched.c:1470: error: structure has no member named `sleep_avg'
kernel/sched.c:1471: warning: implicit declaration of function `HIGH_CREDIT'
kernel/sched.c:1471: warning: implicit declaration of function `LOW_CREDIT'
kernel/sched.c:1472: error: structure has no member named `interactive_credit'
kernel/sched.c: In function `sched_init':
kernel/sched.c:2982: error: structure has no member named `cpu'
kernel/sched.c:2988: error: structure has no member named `array'
make[1]: *** [kernel/sched.o] Error 1
make: *** [kernel] Error 2
plz help me where is the error and how i can solve it.