I installed lunar linux and that went by smoothly but now I'm installing the ralink rt3070 driver to get my USB Dongle working. I've installed this exact same driver on about three other linux systems succesfully (ubuntu gentoo and a lightweight distro that I can't remember...). I used the generic i386 kernel during install and now have a running system, no gui. I extracted the RT3070 driver to my Downloads folder and after tweaking the options as I normally do, I ran make. When I run less or try writing the output to a directory only the first few lines are printed/scrollable. The ones I can see say
Code:
/home/james/Downloads/2010_0831_RT3070_Linux_STA_v2.4.0.1_DPO/os/linux/../../common/crypt_md5.c:595: error: too many arguments to function 'memset'
/home/james/Downloads/2010_0831_RT3070_Linux_STA_v2.4.0.1_DPO/os/linux/../../common/crypt_md5.c:600: error: too many arguments to function 'memset'
/home/james/Downloads/2010_0831_RT3070_Linux_STA_v2.4.0.1_DPO/os/linux/../../common/crypt_md5.c:610: error: too many arguments to function 'memset'
/home/james/Downloads/2010_0831_RT3070_Linux_STA_v2.4.0.1_DPO/os/linux/../../common/crypt_md5.c:621: error: too many arguments to function 'memset'
/home/james/Downloads/2010_0831_RT3070_Linux_STA_v2.4.0.1_DPO/os/linux/../../common/crypt_md5.c: In function 'HMAC_SHA1':
/home/james/Downloads/2010_0831_RT3070_Linux_STA_v2.4.0.1_DPO/os/linux/../../common/crypt_md5.c:729: error: too many arguments to function 'memset'
/home/james/Downloads/2010_0831_RT3070_Linux_STA_v2.4.0.1_DPO/os/linux/../../common/crypt_md5.c:730: error: too many arguments to function 'memset'
/home/james/Downloads/2010_0831_RT3070_Linux_STA_v2.4.0.1_DPO/os/linux/../../common/crypt_md5.c:731: error: too many arguments to function 'memmove'
/home/james/Downloads/2010_0831_RT3070_Linux_STA_v2.4.0.1_DPO/os/linux/../../common/crypt_md5.c:732: error: too many arguments to function 'memmove'
make[2]: *** [/home/james/Downloads/2010_0831_RT3070_Linux_STA_v2.4.0.1_DPO/os/linux/../../common/crypt_md5.o] Error 1
make[1]: *** [_module_/home/james/Downloads/2010_0831_RT3070_Linux_STA_v2.4.0.1_DPO/os/linux] Error 2
make[1]: Leaving directory '/usr/src/linux-2.6.35.3-safe-i386'
make: *** [LINUX] Error 2