Hey everybody- Im getting the "FATAL: modprobe ath_pci not found" with the madwifi instructions. I am getting these strange warnings when i make the source. I dont know how to interpret them so any guidance would be appreciated. on a side note, i have successfully gotten this to work on this machine, but only after making and make installing a second time....i dont know what the deal is. Without further ado here is my output for make:


Checking requirements... ok.
Checking kernel configuration... ok.
mkdir -p ./symbols
for i in ./ath_hal ./net80211 ath_rate/sample ./ath; do \
make -C $i || exit 1; \
done
make[1]: Entering directory `/home/paul/madwifi-ng/ath_hal'
make -C /lib/modules/2.6.11-1.1369_FC4/build SUBDIRS=/home/paul/madwifi-ng/ath_hal MODVERDIR=/home/paul/madwifi-ng/ath_hal/../symbols modules
make[2]: Entering directory `/usr/src/kernels/2.6.11-1.1369_FC4-i686'
Building modules, stage 2.
MODPOST
Warning: could not find /home/paul/madwifi-ng/ath_hal/.hal.o.cmd for /home/paul/madwifi-ng/ath_hal/hal.o
make[2]: Leaving directory `/usr/src/kernels/2.6.11-1.1369_FC4-i686'
make[1]: Leaving directory `/home/paul/madwifi-ng/ath_hal'
make[1]: Entering directory `/home/paul/madwifi-ng/net80211'
make -C /lib/modules/2.6.11-1.1369_FC4/build SUBDIRS=/home/paul/madwifi-ng/net80211 MODVERDIR=/home/paul/madwifi-ng/net80211/../symbols modules
make[2]: Entering directory `/usr/src/kernels/2.6.11-1.1369_FC4-i686'
Building modules, stage 2.
MODPOST
Warning: could not find /home/paul/madwifi-ng/ath_hal/.hal.o.cmd for /home/paul/madwifi-ng/ath_hal/hal.o
make[2]: Leaving directory `/usr/src/kernels/2.6.11-1.1369_FC4-i686'
make[1]: Leaving directory `/home/paul/madwifi-ng/net80211'
make[1]: Entering directory `/home/paul/madwifi-ng/ath_rate/sample'
make -C /lib/modules/2.6.11-1.1369_FC4/build SUBDIRS=/home/paul/madwifi-ng/ath_rate/sample MODVERDIR=/home/paul/madwifi-ng/ath_rate/sample/../../symbols modulesmake[2]: Entering directory `/usr/src/kernels/2.6.11-1.1369_FC4-i686'
Building modules, stage 2.
MODPOST
Warning: could not find /home/paul/madwifi-ng/ath_hal/.hal.o.cmd for /home/paul/madwifi-ng/ath_hal/hal.o
make[2]: Leaving directory `/usr/src/kernels/2.6.11-1.1369_FC4-i686'
make[1]: Leaving directory `/home/paul/madwifi-ng/ath_rate/sample'
make[1]: Entering directory `/home/paul/madwifi-ng/ath'
make -C /lib/modules/2.6.11-1.1369_FC4/build SUBDIRS=/home/paul/madwifi-ng/ath MODVERDIR=/home/paul/madwifi-ng/ath/../symbols modules
make[2]: Entering directory `/usr/src/kernels/2.6.11-1.1369_FC4-i686'
CC [M] /home/paul/madwifi-ng/ath/if_ath_pci.o
cc1: warnings being treated as errors
/home/paul/madwifi-ng/ath/if_ath_pci.c: In function 'ath_pci_resume':
/home/paul/madwifi-ng/ath/if_ath_pci.c:261: warning: ignoring return value of 'pci_set_power_state', declared with attribute warn_unused_result
make[3]: *** [/home/paul/madwifi-ng/ath/if_ath_pci.o] Error 1
make[2]: *** [_module_/home/paul/madwifi-ng/ath] Error 2
make[2]: Leaving directory `/usr/src/kernels/2.6.11-1.1369_FC4-i686'
make[1]: *** [all] Error 2
make[1]: Leaving directory `/home/paul/madwifi-ng/ath'
make: *** [modules] Error 1