Find the answer to your Linux question:
Results 1 to 7 of 7
I've got all the right packages installed, I thought, but I keep getting this error on compile.. any suggestions? Thank you. Compiling ... --------- Error log - file /home/downerczx/.WineCVS/sources/cvscedega/ErrorLog : ...
Enjoy an ad free experience by logging in. Not a member yet? Register.
  1. #1
    Just Joined!
    Join Date
    May 2006
    Posts
    9

    Cedega Compile Error


    I've got all the right packages installed, I thought, but I keep getting this error on compile.. any suggestions? Thank you.

    Compiling ...




    --------- Error log - file /home/downerczx/.WineCVS/sources/cvscedega/ErrorLog : ---------
    make[1]: Entering directory `/home/downerczx/.WineCVS/sources/cvscedega/winex/unicode'
    make[1]: `libwine_unicode.so' is up to date.
    make[1]: Leaving directory `/home/downerczx/.WineCVS/sources/cvscedega/winex/unicode'
    make[1]: Entering directory `/home/downerczx/.WineCVS/sources/cvscedega/winex/tools'
    make[2]: Entering directory `/home/downerczx/.WineCVS/sources/cvscedega/winex/tools/winebuild'
    gcc -g -O2 -Wall -mpreferred-stack-boundary=2 -fno-keep-static-consts -D__const=const -fno-strict-aliasing -Wa,--execstack -D__int8=char -D__int16=short -D__int32=int "-D__int64=long long" -o winebuild import.o main.o parser.o relay.o res16.o res32.o spec16.o spec32.o utils.o -L../../unicode -lwine_unicode
    ../../unicode/libwine_unicode.so: undefined reference to `cptable_437'
    collect2: ld returned 1 exit status
    make[2]: *** [winebuild] Error 1
    make[2]: Leaving directory `/home/downerczx/.WineCVS/sources/cvscedega/winex/tools/winebuild'
    make[1]: *** [winebuild] Error 2
    make[1]: Leaving directory `/home/downerczx/.WineCVS/sources/cvscedega/winex/tools'
    make: *** [tools] Error 2

  2. #2
    Linux Guru antidrugue's Avatar
    Join Date
    Oct 2005
    Location
    Montreal, Canada
    Posts
    3,211
    Which distro are you using? Do you have all the requirements to compile cedega? More info here:
    http://www.linux-gamers.net/modules/...WTO+Cedega+CVS
    "To express yourself in freedom, you must die to everything of yesterday. From the 'old', you derive security; from the 'new', you gain the flow."

    -Bruce Lee

  3. #3
    Just Joined!
    Join Date
    May 2006
    Posts
    9
    I'm using SuSE 10.1. I checked and I have all of those installed. I had some confusion of whether to use "flex" or "flex-old" so I tried it with either one and it was the same error.

  4. #4
    Just Joined!
    Join Date
    May 2006
    Posts
    9
    OK, this is weird. I installed another library that wasn't required on that page, and I got a little further... xorg-x11-sdk, and now I get a different error. (I think it was further anyway)

    --------- Error log - file /home/downerczx/.WineCVS/sources/cvscedega/ErrorLog : ---------
    make[2]: `libglu32.so' is up to date.
    make[2]: Leaving directory `/home/downerczx/.WineCVS/sources/cvscedega/winex/dlls/glu32'
    make[2]: Entering directory `/home/downerczx/.WineCVS/sources/cvscedega/winex/dlls/ntdll'
    make[3]: Entering directory `/home/downerczx/.WineCVS/sources/cvscedega/winex/files'
    make[3]: `files.o' is up to date.
    make[3]: Leaving directory `/home/downerczx/.WineCVS/sources/cvscedega/winex/files'
    make[3]: Entering directory `/home/downerczx/.WineCVS/sources/cvscedega/winex/if1632'
    make[3]: `if1632.o' is up to date.
    make[3]: Leaving directory `/home/downerczx/.WineCVS/sources/cvscedega/winex/if1632'
    make[3]: Entering directory `/home/downerczx/.WineCVS/sources/cvscedega/winex/loader'
    make[3]: `loader.o' is up to date.
    make[3]: Leaving directory `/home/downerczx/.WineCVS/sources/cvscedega/winex/loader'
    make[3]: Entering directory `/home/downerczx/.WineCVS/sources/cvscedega/winex/loader/ne'
    make[3]: `ne.o' is up to date.
    make[3]: Leaving directory `/home/downerczx/.WineCVS/sources/cvscedega/winex/loader/ne'
    make[3]: Entering directory `/home/downerczx/.WineCVS/sources/cvscedega/winex/memory'
    make[3]: `memory.o' is up to date.
    make[3]: Leaving directory `/home/downerczx/.WineCVS/sources/cvscedega/winex/memory'
    make[3]: Entering directory `/home/downerczx/.WineCVS/sources/cvscedega/winex/misc'
    make[3]: `misc.o' is up to date.
    make[3]: Leaving directory `/home/downerczx/.WineCVS/sources/cvscedega/winex/misc'
    make[3]: Entering directory `/home/downerczx/.WineCVS/sources/cvscedega/winex/msdos'
    make[3]: `msdos.o' is up to date.
    make[3]: Leaving directory `/home/downerczx/.WineCVS/sources/cvscedega/winex/msdos'
    make[3]: Entering directory `/home/downerczx/.WineCVS/sources/cvscedega/winex/ole'
    make[3]: `ole.o' is up to date.
    make[3]: Leaving directory `/home/downerczx/.WineCVS/sources/cvscedega/winex/ole'
    make[3]: Entering directory `/home/downerczx/.WineCVS/sources/cvscedega/winex/relay32'
    make[3]: `relay32.o' is up to date.
    make[3]: Leaving directory `/home/downerczx/.WineCVS/sources/cvscedega/winex/relay32'
    make[3]: Entering directory `/home/downerczx/.WineCVS/sources/cvscedega/winex/scheduler'
    make[3]: `scheduler.o' is up to date.
    make[3]: Leaving directory `/home/downerczx/.WineCVS/sources/cvscedega/winex/scheduler'
    make[3]: Entering directory `/home/downerczx/.WineCVS/sources/cvscedega/winex/win32'
    make[3]: `win32.o' is up to date.
    make[3]: Leaving directory `/home/downerczx/.WineCVS/sources/cvscedega/winex/win32'
    make[2]: Leaving directory `/home/downerczx/.WineCVS/sources/cvscedega/winex/dlls/ntdll'
    make[2]: Entering directory `/home/downerczx/.WineCVS/sources/cvscedega/winex/dlls/kernel'
    gcc -MMD -c -I. -I. -I../../include -I../../include -g -O2 -Wall -mpreferred-stack-boundary=2 -fno-keep-static-consts -D__const=const -fno-strict-aliasing -Wa,--execstack -D__int8=char -D__int16=short -D__int32=int "-D__int64=long long" -fPIC -D__WINE__ -D_REENTRANT -I/usr/X11R6/include -o time.o time.c
    time.c: In function ‘SetTimeZoneInformation’:
    time.c:479: warning: null argument where non-null required (argument 1)
    time.c: In function ‘TIME_ClockTimeToFileTime’:
    time.c:532: error: ‘CLK_TCK’ undeclared (first use in this function)
    time.c:532: error: (Each undeclared identifier is reported only once
    time.c:532: error: for each function it appears in.)
    make[2]: *** [time.o] Error 1
    make[2]: Leaving directory `/home/downerczx/.WineCVS/sources/cvscedega/winex/dlls/kernel'
    make[1]: *** [kernel/libkernel32.so] Error 2
    make[1]: Leaving directory `/home/downerczx/.WineCVS/sources/cvscedega/winex/dlls'
    make: *** [dlls] Error 2

  5. #5
    Just Joined!
    Join Date
    May 2006
    Posts
    9
    Still getting this error... all needed packages are installed... can anyone hazard a guess? Thank you.

  6. #6
    Just Joined!
    Join Date
    May 2006
    Posts
    9
    Still getting this error... all needed packages are installed... can anyone hazard a guess? Thank you.

  7. #7
    Linux Guru antidrugue's Avatar
    Join Date
    Oct 2005
    Location
    Montreal, Canada
    Posts
    3,211
    Quote Originally Posted by downerczx
    make[2]: Entering directory `/home/downerczx/.WineCVS/sources/cvscedega/winex/dlls/kernel'
    gcc -MMD -c -I. -I. -I../../include -I../../include -g -O2 -Wall -mpreferred-stack-boundary=2 -fno-keep-static-consts -D__const=const -fno-strict-aliasing -Wa,--execstack -D__int8=char -D__int16=short -D__int32=int "-D__int64=long long" -fPIC -D__WINE__ -D_REENTRANT -I/usr/X11R6/include -o time.o time.c
    time.c: In function ‘SetTimeZoneInformation’:
    time.c:479: warning: null argument where non-null required (argument 1)
    time.c: In function ‘TIME_ClockTimeToFileTime’:
    time.c:532: error: ‘CLK_TCK’ undeclared (first use in this function)
    time.c:532: error: (Each undeclared identifier is reported only once
    time.c:532: error: for each function it appears in.)
    make[2]: *** [time.o] Error 1
    make[2]: Leaving directory `/home/downerczx/.WineCVS/sources/cvscedega/winex/dlls/kernel'
    make[1]: *** [kernel/libkernel32.so] Error 2
    make[1]: Leaving directory `/home/downerczx/.WineCVS/sources/cvscedega/winex/dlls'
    make: *** [dlls] Error 2
    This error seems to suggest that you are missing some X development files. Did you install all the ones suggested in the "Cedega How-to"?

    Look into
    Code:
    ./configure --help
    and see if you can work around this.
    "To express yourself in freedom, you must die to everything of yesterday. From the 'old', you derive security; from the 'new', you gain the flow."

    -Bruce Lee

Posting Permissions

  • You may not post new threads
  • You may not post replies
  • You may not post attachments
  • You may not edit your posts
  •